{"text_format":"1","workbook":"xlsx","n_sheets":9,"sheets":["目次","搭載機能仕様書(スキャナ編)","PSPパラメータ対応表","ファイル名抽出方法の詳細","（参考）SearchablePDF対応欧州言語一覧","（参考）禁則表1(PSP記載読込設定同士の組禁)","（参考）中国語の並び替え","(参考）OOXML出力形式 ","リファイン履歴"],"not_rendered":{"charts":0,"images":16,"macros":1,"external_links":0,"defined_names":1,"comments":1,"pivot_tables":0},"unopened":[],"bounds":{"document_bytes":16777216,"sheet_cells":100000,"rows_first":2000,"rows_last":500,"rows_between":2000,"halvings":0,"cell_chars":16384,"cell_head_chars":4096},"cells_cut":0,"cells_raw":0,"read":"whole","date_system":"1900"}

{"sheet":"目次","index":0,"n_rows":1014,"n_cols":43,"rows_kept":1014,"cut":false,"hidden":false,"merged":[[124,40,124,41],[137,40,137,41],[144,40,144,41],[177,40,177,41],[181,40,181,41],[120,40,120,41],[27,40,27,41],[29,40,29,41],[49,40,49,41],[61,40,61,41],[67,40,67,41],[73,40,73,41],[79,40,79,41],[85,40,85,41],[93,40,93,41],[102,40,102,41],[116,40,116,41],[25,40,25,41],[1,35,1,41],[4,40,4,41],[8,40,8,41],[13,40,13,41],[16,40,16,41]]}
[null,null,null,null,null,null,null,null,null,null,null,null,null,null,"SP","F","BIN",4,3,2,1,null,null,null,null,null,null,null,null,null,null,null,null,null,null,"TMP","TMP","TMP","TMP","TMP","TMP","TMP","TMP"]
[null,null,null,null,null,"☆Stella_TSS１機能仕様　目次",null,null,null,null,null,null,null,null,null,null,{"$f":"IF(P2=\"\",\"\",DEC2BIN(P2,4))","v":""},{"$f":"IF($Q2=\"\",\"\",VALUE(MID($Q2,1,1)))","v":""},{"$f":"IF($Q2=\"\",\"\",VALUE(MID($Q2,2,1)))","v":""},{"$f":"IF($Q2=\"\",\"\",VALUE(MID($Q2,3,1)))","v":""},{"$f":"IF($Q2=\"\",\"\",VALUE(MID($Q2,4,1)))","v":""},null,null,null,null,null,"Contents of Stella_TSS1 Functional Specification ",null,null,null,null,null,null,null,null,"Contents of Stella_TSS1 Functional Specification "]
[null,null,null,null,null,null,null,null,null,null,null,null,null,null,null,null,{"$f":"IF(P3=\"\",\"\",DEC2BIN(P3,4))","v":""},{"$f":"IF($Q3=\"\",\"\",VALUE(MID($Q3,1,1)))","v":""},{"$f":"IF($Q3=\"\",\"\",VALUE(MID($Q3,2,1)))","v":""},{"$f":"IF($Q3=\"\",\"\",VALUE(MID($Q3,3,1)))","v":""},{"$f":"IF($Q3=\"\",\"\",VALUE(MID($Q3,4,1)))","v":""}]
["大","中",null,"文書番号",null,"ファイル",null,"Stella","TSS1",null,"見出し","機能名称","備考",null,null,null,{"$f":"IF(P4=\"\",\"\",DEC2BIN(P4,4))","v":""},{"$f":"IF($Q4=\"\",\"\",VALUE(MID($Q4,1,1)))","v":""},{"$f":"IF($Q4=\"\",\"\",VALUE(MID($Q4,2,1)))","v":""},{"$f":"IF($Q4=\"\",\"\",VALUE(MID($Q4,3,1)))","v":""},{"$f":"IF($Q4=\"\",\"\",VALUE(MID($Q4,4,1)))","v":""},"大","中",null,"文書番号",null,"File ",null,"Stella","TSS1",null,"Index","Functional Name ","Remark",null,"File ",null,"Stella","TSS1",null,"Index","Functional Name ","Remark"]
[1,0,{"$f":"IF(A4<>A5,0,IF(B3<>B4,0,C4+1))","v":0},{"$f":"IF(K5<>\"\",0,CONCATENATE(IF(A5>9,\"FNC-0\",\"FNC-00\"),TEXT(A5,\"0\"),\"-\",TEXT(B5,\"0\"),IF(C5>9,\"0\",\"00\"),TEXT(C5,\"0\")))","v":0},null,"スキャナ編",null,"○","○",null,"§１．　スキャナ関連",null,null,null,null,null,"","","","","",1,0,{"$f":"IF(V4<>V5,0,IF(W3<>W4,0,X4+1))","v":0},{"$f":"IF(AF5<>\"\",0,CONCATENATE(IF(V5>9,\"FNC-0\",\"FNC-00\"),TEXT(V5,\"0\"),\"-\",TEXT(W5,\"0\"),IF(X5>9,\"0\",\"00\"),TEXT(X5,\"0\")))","v":0},null,"Scanner ",null,"O","O",null,"§１．　スキャナ関連",null,null,null,"Scanner ",null,"O","O",null,"1.        Relating to Scanner"]
[{"$f":"IF(K6<>\"\",IF(MID(K6,FIND(\"．\",K6,1)+1,1)=\"　\",A5+1,A5),A5)","v":1},{"$f":"IF($K6<>\"\",IF(A5<>A6,0,IF(MID($K6,FIND(\"．\",$K6,1)+1,1)<>\"　\",IF(MID($K6,FIND(\"．\",$K6,FIND(\"．\",$K6,1)+1)+1,1)=\"　\",B5+1,B5),B5)),B5)","v":1},{"$f":"IF(K6<>\"\",IF(AND(A5=A6,B5=B6),C5,0),C5+1)","v":0},{"$f":"IF(K6<>\"\",0,CONCATENATE(IF(A6>9,\"FNC-0\",\"FNC-00\"),TEXT(A6,\"0\"),\"-\",TEXT(B6,\"0\"),IF(C6>9,\"0\",\"00\"),TEXT(C6,\"0\")))","v":0},null,"スキャナ編",null,"○","○",null,"§１．１．　ネットワークスキャナの定義",null,null,null,null,null,"","","","","",{"$f":"IF(AF6<>\"\",IF(MID(AF6,FIND(\"．\",AF6,1)+1,1)=\"　\",V5+1,V5),V5)","v":1},{"$f":"IF($K6<>\"\",IF(V5<>V6,0,IF(MID($K6,FIND(\"．\",$K6,1)+1,1)<>\"　\",IF(MID($K6,FIND(\"．\",$K6,FIND(\"．\",$K6,1)+1)+1,1)=\"　\",W5+1,W5),W5)),W5)","v":1},{"$f":"IF(AF6<>\"\",IF(AND(V5=V6,W5=W6),X5,0),X5+1)","v":0},{"$f":"IF(AF6<>\"\",0,CONCATENATE(IF(V6>9,\"FNC-0\",\"FNC-00\"),TEXT(V6,\"0\"),\"-\",TEXT(W6,\"0\"),IF(X6>9,\"0\",\"00\"),TEXT(X6,\"0\")))","v":0},null,"Scanner ",null,"O","O",null,"§１．１．　ネットワークスキャナの定義","Definition of network scanner",null,null,"Scanner ",null,"O","O",null,"1.1.","Definition of network scanner"]
[{"$f":"IF(K7<>\"\",IF(MID(K7,FIND(\"．\",K7,1)+1,1)=\"　\",A6+1,A6),A6)","v":1},{"$f":"IF($K7<>\"\",IF(A6<>A7,0,IF(MID($K7,FIND(\"．\",$K7,1)+1,1)<>\"　\",IF(MID($K7,FIND(\"．\",$K7,FIND(\"．\",$K7,1)+1)+1,1)=\"　\",B6+1,B6),B6)),B6)","v":1},{"$f":"IF(K7<>\"\",IF(AND(A6=A7,B6=B7),C6,0),C6+1)","v":1},{"$f":"IF(K7<>\"\",0,CONCATENATE(IF(A7>9,\"FNC-0\",\"FNC-00\"),TEXT(A7,\"0\"),\"-\",TEXT(B7,\"0\"),IF(C7>9,\"0\",\"00\"),TEXT(C7,\"0\")))","v":"FNC-001-1001"},{"$f":"IF(E6<>\"\",E6+1,IF(E5<>\"\",E5+1,IF(E4<>\"\",E4+1,E3+1)))","v":1},"スキャナ編",null,"○","○",null,null,"ネットワークスキャナの位置づけ",null,null,null,null,"","","","","",{"$f":"IF(AF7<>\"\",IF(MID(AF7,FIND(\"．\",AF7,1)+1,1)=\"　\",V6+1,V6),V6)","v":1},{"$f":"IF($K7<>\"\",IF(V6<>V7,0,IF(MID($K7,FIND(\"．\",$K7,1)+1,1)<>\"　\",IF(MID($K7,FIND(\"．\",$K7,FIND(\"．\",$K7,1)+1)+1,1)=\"　\",W6+1,W6),W6)),W6)","v":1},{"$f":"IF(AF7<>\"\",IF(AND(V6=V7,W6=W7),X6,0),X6+1)","v":1},{"$f":"IF(AF7<>\"\",0,CONCATENATE(IF(V7>9,\"FNC-0\",\"FNC-00\"),TEXT(V7,\"0\"),\"-\",TEXT(W7,\"0\"),IF(X7>9,\"0\",\"00\"),TEXT(X7,\"0\")))","v":"FNC-001-1001"},{"$f":"IF(Z6<>\"\",Z6+1,IF(Z5<>\"\",Z5+1,IF(Z4<>\"\",Z4+1,Z3+1)))","v":1},"Scanner ",null,"O","O",null,null,"Positioning of network scanner",null,null,"Scanner ",null,"O","O",null,null,"Positioning of network scanner"]
[{"$f":"IF(K8<>\"\",IF(MID(K8,FIND(\"．\",K8,1)+1,1)=\"　\",A7+1,A7),A7)","v":1},{"$f":"IF($K8<>\"\",IF(A7<>A8,0,IF(MID($K8,FIND(\"．\",$K8,1)+1,1)<>\"　\",IF(MID($K8,FIND(\"．\",$K8,FIND(\"．\",$K8,1)+1)+1,1)=\"　\",B7+1,B7),B7)),B7)","v":1},{"$f":"IF(K8<>\"\",IF(AND(A7=A8,B7=B8),C7,0),C7+1)","v":2},{"$f":"IF(K8<>\"\",0,CONCATENATE(IF(A8>9,\"FNC-0\",\"FNC-00\"),TEXT(A8,\"0\"),\"-\",TEXT(B8,\"0\"),IF(C8>9,\"0\",\"00\"),TEXT(C8,\"0\")))","v":"FNC-001-1002"},{"$f":"IF(E7<>\"\",E7+1,IF(E6<>\"\",E6+1,IF(E5<>\"\",E5+1,E4+1)))","v":2},"スキャナ編",null,"○","○",null,null,"ユーザーに提供する機能一覧",null,null,null,null,"","","","","",{"$f":"IF(AF8<>\"\",IF(MID(AF8,FIND(\"．\",AF8,1)+1,1)=\"　\",V7+1,V7),V7)","v":1},{"$f":"IF($K8<>\"\",IF(V7<>V8,0,IF(MID($K8,FIND(\"．\",$K8,1)+1,1)<>\"　\",IF(MID($K8,FIND(\"．\",$K8,FIND(\"．\",$K8,1)+1)+1,1)=\"　\",W7+1,W7),W7)),W7)","v":1},{"$f":"IF(AF8<>\"\",IF(AND(V7=V8,W7=W8),X7,0),X7+1)","v":2},{"$f":"IF(AF8<>\"\",0,CONCATENATE(IF(V8>9,\"FNC-0\",\"FNC-00\"),TEXT(V8,\"0\"),\"-\",TEXT(W8,\"0\"),IF(X8>9,\"0\",\"00\"),TEXT(X8,\"0\")))","v":"FNC-001-1002"},{"$f":"IF(Z7<>\"\",Z7+1,IF(Z6<>\"\",Z6+1,IF(Z5<>\"\",Z5+1,Z4+1)))","v":2},"Scanner ",null,"O","O",null,null,"List of function offered for a user",null,null,"Scanner ",null,"O","O",null,null,"List of function offered for a user"]
[1,2,0,0,null,"スキャナ編",null,"○","○",null,"§１．２．　システム構成と操作ストーリー：本体起動スキャン",null,null,null,null,null,"","","","","",1,2,0,0,null,"Scanner ",null,"O","O",null,"§１．２．　システム構成と操作ストーリー：本体起動スキャン",null,null,null,"Scanner ",null,"O","O",null,"1.2.      System configuration and operational story : \n              Scan with main unit start-up                  "]
[1,2,1,"FNC-001-2001",3,"スキャナ編",null,"○","○",null,null,"ScanToE-mail",null,null,null,null,"","","","","",1,2,1,"FNC-001-2001",3,"Scanner ",null,"O","O",null,null,"ScanToE-mail",null,null,"Scanner ",null,"O","O",null,null,"ScanToE-mail"]
[1,2,2,"FNC-001-2002",4,"スキャナ編",null,"○","○",null,null,"ScanToFTP",null,null,null,null,"","","","","",1,2,2,"FNC-001-2002",4,"Scanner ",null,"O","O",null,null,"ScanToFTP",null,null,"Scanner ",null,"O","O",null,null,"ScanToFTP"]
[1,2,3,"FNC-001-2003",5,"スキャナ編",null,"○","○",null,null,"ScanToPC(SMB)",null,null,null,null,"","","","","",1,2,3,"FNC-001-2003",5,"Scanner ",null,"O","O",null,null,"ScanToPC(SMB)",null,null,"Scanner ",null,"O","O",null,null,"ScanToPC(SMB)"]
[1,2,4,"FNC-001-2004",6,"スキャナ編",null,"○","○",null,null,"ScanToBox",null,null,null,null,"","","","","",1,2,4,"FNC-001-2004",6,"Scanner ",null,"O","O",null,null,"ScanToBox",null,null,"Scanner ",null,"O","O",null,null,"ScanToBox"]
[1,3,0,0,null,"スキャナ編",null,"○","○",null,"§１．３．　システム構成と操作ストーリー：PC起動スキャン",null,null,null,null,null,"","","","","",1,3,0,0,null,"Scanner ",null,"O","O",null,"§１．３．　システム構成と操作ストーリー：PC起動スキャン",null,null,null,"Scanner ",null,"O","O",null,"1.3.       System configuration and operational story : PC start-up scan "]
[1,3,1,"FNC-001-3001",7,"スキャナ編",null,"○","○",null,null,"Real Mode TWAIN",null,null,null,null,"","","","","",1,3,1,"FNC-001-3001",7,"Scanner ",null,"O","O",null,null,"Real Mode TWAIN",null,null,"Scanner ",null,"O","O",null,null,"Real Mode TWAIN"]
[1,3,2,"FNC-001-3002",8,"スキャナ編",null,"○","○",null,null,"HDD TWAIN",null,null,null,null,"","","","","",1,3,2,"FNC-001-3002",8,"Scanner ",null,"O","O",null,null,"HDD TWAIN",null,null,"Scanner ",null,"O","O",null,null,"HDD TWAIN"]
[1,4,0,0,null,"スキャナ編",null,"○","○",null,"§１．４．　基本動作",null,null,null,null,null,"","","","","",1,4,0,0,null,"Scanner ",null,"O","O",null,"§１．４．　基本動作",null,null,null,"Scanner ",null,"O","O",null,"1.4.      Basic operation "]
[1,4,1,"FNC-001-4001",9,"スキャナ編",null,"○","○",null,null,"本体起動スキャン",null,null,null,null,"","","","","",1,4,1,"FNC-001-4001",9,"Scanner ",null,"O","O",null,null,"Main unit start-up scan ",null,null,"Scanner ",null,"O","O",null,null,"Main unit start-up scan "]
[1,4,2,"FNC-001-4002",10,"スキャナ編",null,"○","○",null,null,"本体起動スキャン受付条件",null,null,null,null,"","","","","",1,4,2,"FNC-001-4002",10,"Scanner ",null,"O","O",null,null,"Conditions of an acceptance of the main unit start-up scan ",null,null,"Scanner ",null,"O","O",null,null,"Conditions of an acceptance of the main unit start-up scan "]
[1,4,3,"FNC-001-4003",11,"スキャナ編",null,"○","○",null,null,"PC起動スキャン",null,null,null,null,"","","","","",1,4,3,"FNC-001-4003",11,"Scanner ",null,"O","O",null,null,"PC start-up scan ",null,null,"Scanner ",null,"O","O",null,null,"PC start-up scan "]
[1,4,4,"FNC-001-4004",12,"スキャナ編",null,"○","○",null,null,"PC起動スキャン受付条件",null,null,null,null,"","","","","",1,4,4,"FNC-001-4004",12,"Scanner ",null,"O","O",null,null,"Conditions of an acceptance of PC start-up scan ",null,null,"Scanner ",null,"O","O",null,null,"Conditions of an acceptance of PC start-up scan "]
[1,4,5,"FNC-001-4005",13,"スキャナ編",null,"○","○",null,null,"Box画像配信",null,null,null,null,"","","","","",1,4,5,"FNC-001-4005",13,"Scanner ",null,"O","O",null,null,"Box stored image transmission ",null,null,"Scanner ",null,"O","O",null,null,"Box stored image transmission "]
[1,4,6,"FNC-001-4006",14,"スキャナ編",null,"○","○",null,null,"Box画像配信受付条件",null,null,null,null,"","","","","",1,4,6,"FNC-001-4006",14,"Scanner ",null,"O","O",null,null,"Conditions of acceptance of Box stored image transmission ",null,null,"Scanner ",null,"O","O",null,null,"Conditions of acceptance of Box stored image transmission "]
[1,4,7,"FNC-001-4007",15,"スキャナ編",null,"○","○",null,null,"スキャン画像の破棄",null,null,null,null,"","","","","",1,4,7,"FNC-001-4007",15,"Scanner ",null,"O","O",null,null,"Deletion of scanned image",null,null,"Scanner ",null,"O","O",null,null,"Deletion of scanned image"]
[1,4,8,"FNC-001-4008",16,"スキャナ編",null,"○","○",null,null,"スキャン画像強制破棄条件",null,null,null,null,"","","","","",1,4,8,"FNC-001-4008",16,"Scanner ",null,"O","O",null,null,"Conditions of forcible deletion of scanned image",null,null,"Scanner ",null,"O","O",null,null,"Conditions of forcible deletion of scanned image"]
[1,5,0,0,null,"スキャナ編",null,"○","○",null,"§１．５．　基本操作",null,null,null,null,null,"","","","","",1,5,0,0,null,"Scanner ",null,"O","O",null,"§１．５．　基本操作",null,null,null,"Scanner ",null,"O","O",null,"1.5.       Basic operation          "]
[1,5,1,"FNC-001-5001",17,"スキャナ編",null,"○","○",null,null,"パネルリセット",null,null,null,null,"","","","","",1,5,1,"FNC-001-5001",17,"Scanner ",null,"O","O",null,null,"Panel reset",null,null,"Scanner ",null,"O","O",null,null,"Panel reset"]
[1,6,0,0,null,"スキャナ編",null,"○","○",null,"§１．６．　モード設定",null,null,null,null,null,"","","","","",1,6,0,0,null,"Scanner ",null,"O","O",null,"§１．６．　モード設定",null,null,null,"Scanner ",null,"O","O",null,"1.6.      Setting mode "]
[1,6,1,"FNC-001-6001",18,"スキャナ編",null,"○","○",null,null,"本体設定とPC設定の分担",null,null,null,null,"","","","","",1,6,1,"FNC-001-6001",18,"Scanner ",null,"O","O",null,null,"Assigning tasks for mode setting/main unit or PC setting\". ",null,null,"Scanner ",null,"O","O",null,null,"Assigning tasks for mode setting/main unit or PC setting\". "]
[1,6,1,0,null,"スキャナ編",null,"○","○",null,"§１．６．１．　読取りモード設定",null,null,null,null,null,"","","","","",1,6,1,0,null,"Scanner ",null,"O","O",null,"§１．６．１．　読取りモード設定",null,null,null,"Scanner ",null,"O","O",null,"1.6.1.        Setting of scan mode"]
[1,6,2,"FNC-001-6002",19,"スキャナ編",null,"○","○",null,null,"解像度",null,null,null,null,"","","","","",1,6,2,"FNC-001-6002",19,"Scanner ",null,"O","O",null,null,"Resolution ",null,null,"Scanner ",null,"O","O",null,null,"Resolution "]
[1,6,3,"FNC-001-6003",20,"スキャナ編",null,"○","○",null,null,"下地除去",null,null,null,null,"","","","","",1,6,3,"FNC-001-6003",20,"Scanner ",null,"O","O",null,null,"Background Removal ",null,null,"Scanner ",null,"O","O",null,null,"Background Removal "]
[1,6,4,"FNC-001-6004",21,"スキャナ編",null,"○","○",null,null,"カラーモード",null,null,null,null,"","","","","",1,6,4,"FNC-001-6004",21,"Scanner ",null,"O","O",null,null,"Color mode",null,null,"Scanner ",null,"O","O",null,null,"Color mode"]
[1,6,5,"FNC-001-6005",22,"スキャナ編",null,"○","○",null,null,"原稿サイズ",null,null,null,null,"","","","","",1,6,5,"FNC-001-6005",22,"Scanner ",null,"O","O",null,null,"Original size",null,null,"Scanner ",null,"O","O",null,null,"Original size"]
[1,6,6,"FNC-001-6006",23,"スキャナ編",null,"○","○",null,null,"両面原稿",null,null,null,null,"","","","","",1,6,6,"FNC-001-6006",23,"Scanner ",null,"O","O",null,null,"Duplex originals",null,null,"Scanner ",null,"O","O",null,null,"Duplex originals"]
[1,6,7,"FNC-001-6007",24,"スキャナ編",null,"○","○",null,null,"ブック原稿",null,null,null,null,"","","","","",1,6,7,"FNC-001-6007",24,"Scanner ",null,"O","O",null,null,"Book originals",null,null,"Scanner ",null,"O","O",null,null,"Book originals"]
[1,6,8,"FNC-001-6008",25,"スキャナ編",null,"○","○",null,null,"原稿の向き",null,null,null,null,"","","","","",1,6,8,"FNC-001-6008",25,"Scanner ",null,"O","O",null,null,"Original orientation ",null,null,"Scanner ",null,"O","O",null,null,"Original orientation "]
[1,6,9,"FNC-001-6009",26,"スキャナ編",null,"○","○",null,null,"原稿綴じ位置",null,null,null,null,"","","","","",1,6,9,"FNC-001-6009",26,"Scanner ",null,"O","O",null,null,"Original binding position ",null,null,"Scanner ",null,"O","O",null,null,"Original binding position "]
[1,6,10,"FNC-001-6010",27,"スキャナ編",null,"○","○",null,null,"分割読み込み",null,null,null,null,"","","","","",1,6,10,"FNC-001-6010",27,"Scanner ",null,"O","O",null,null,"Split scan ",null,null,"Scanner ",null,"O","O",null,null,"Split scan "]
[1,6,11,"FNC-001-6011",28,"スキャナ編",null,"○","○",null,null,"イレース",null,null,null,null,"","","","","",1,6,11,"FNC-001-6011",28,"Scanner ",null,"O","O",null,null,"Erase",null,null,"Scanner ",null,"O","O",null,null,"Erase"]
[1,6,12,"FNC-001-6012",29,"スキャナ編",null,"○","○",null,null,"スキャナ画質",null,null,null,null,"","","","","",1,6,12,"FNC-001-6012",29,"Scanner ",null,"O","O",null,null,"Scanner image quality ",null,null,"Scanner ",null,"O","O",null,null,"Scanner image quality "]
[1,6,13,"FNC-001-6013",30,"スキャナ編",null,"○","○",null,null,"倍率",null,null,null,null,"","","","","",1,6,13,"FNC-001-6013",30,"Scanner ",null,"O","O",null,null,"Magnification",null,null,"Scanner ",null,"O","O",null,null,"Magnification"]
[1,6,14,"FNC-001-6014",31,"スキャナ編",null,"○","○",null,null,"原稿台",null,null,null,null,"","","","","",1,6,14,"FNC-001-6014",31,"Scanner ",null,"O","O",null,null,"ADF",null,null,"Scanner ",null,"O","O",null,null,"ADF"]
[1,6,15,"FNC-001-6015",32,"スキャナ編",null,"○","○",null,null,"プレビュー",null,null,null,null,"","","","","",1,6,15,"FNC-001-6015",32,"Scanner ",null,"O","O",null,null,"Preview",null,null,"Scanner ",null,"O","O",null,null,"Preview"]
[1,6,16,"FNC-001-6016",33,"スキャナ編",null,"○","○",null,null,"特殊原稿",null,null,null,null,"","","","","",1,6,16,"FNC-001-6016",33,"Scanner ",null,"O","O",null,null,"Special original ",null,null,"Scanner ",null,"O","O",null,null,"Special original "]
[1,6,17,"FNC-001-6017",34,"スキャナ編",null,"○","x",null,null,"ページ連写",null,null,null,null,"","","","","",1,6,17,"FNC-001-6017",34,"Scanner ",null,"O","x",null,null,"Book copying ",null,null,"Scanner ",null,"O","x",null,null,"Book copying "]
[1,6,18,"FNC-001-6018",35,"スキャナ編",null,"○","○",null,null,"全面画像",null,null,null,null,"","","","","",1,6,18,"FNC-001-6018",35,"Scanner ",null,"O","O",null,null,"Full image area",null,null,"Scanner ",null,"O","O",null,null,"Full image area"]
[1,6,19,"FNC-001-6019",36,"スキャナ編",null,"○","○",null,null,"ネガポジ反転",null,null,null,null,"","","","","",1,6,19,"FNC-001-6019",36,"Scanner ",null,"O","O",null,null,"Negative/positive reverse",null,null,"Scanner ",null,"O","O",null,null,"Negative/positive reverse"]
[1,6,20,"FNC-001-6020",37,"スキャナ編",null,"○","x",null,null,"原稿外自動消去",null,null,null,null,"","","","","",1,6,20,"FNC-001-6020",37,"Scanner ",null,"O","x",null,null,"Non-image area auto erase",null,null,"Scanner ",null,"O","x",null,null,"Non-image area auto erase"]
[1,6,20,0,null,"スキャナ編",null,"○","○",null,"§１．６．２．　配信モード設定(共通)",null,null,null,null,null,"","","","","",1,6,20,0,null,"Scanner ",null,"O","O",null,"§１．６．２．　配信モード設定(共通)",null,null,null,"Scanner ",null,"O","O",null,"1.6.2.  Setting of transmission mode (common)"]
[1,6,21,"FNC-001-6021",38,"スキャナ編",null,"○","○",null,null,"インデックス選択",null,null,null,null,"","","","","",1,6,21,"FNC-001-6021",38,"Scanner ",null,"O","O",null,null,"Index selection ",null,null,"Scanner ",null,"O","O",null,null,"Index selection "]
[1,6,22,"FNC-001-6022",39,"スキャナ編",null,"○","○",null,null,"短縮宛先呼び出し",null,null,null,null,"","","","","",1,6,22,"FNC-001-6022",39,"Scanner ",null,"O","O",null,null,"Recall of Address book",null,null,"Scanner ",null,"O","O",null,null,"Recall of Address book"]
[1,6,23,"FNC-001-6023",40,"スキャナ編",null,"○","○",null,null,"グループ宛先呼び出し",null,null,null,null,"","","","","",1,6,23,"FNC-001-6023",40,"Scanner ",null,"O","O",null,null,"Recall of Group destination ",null,null,"Scanner ",null,"O","O",null,null,"Recall of Group destination "]
[1,6,24,"FNC-001-6024",41,"スキャナ編",null,null,null,null,null,"並び順と表示の変更",null,null,null,1,"0001",0,0,0,1,1,6,24,"FNC-001-6024",41]
[1,6,25,"FNC-001-6025",42,"スキャナ編",null,"○","○",null,null,"プログラムキー呼び出し",null,null,null,null,"","","","","",1,6,25,"FNC-001-6025",42,"Scanner ",null,"O","O",null,null,"Recall of program key ",null,null,"Scanner ",null,"O","O",null,null,"Recall of program key "]
[1,6,26,"FNC-001-6026",43,"スキャナ編",null,"○","○",null,null,"一時配信設定呼び出し",null,null,null,null,"","","","","",1,6,26,"FNC-001-6026",43,"Scanner ",null,"O","O",null,null,"Recall of temporary one-touch setting ",null,null,"Scanner ",null,"O","O",null,null,"Recall of temporary one-touch setting "]
[1,6,27,"FNC-001-6027",44,"スキャナ編",null,"○","○",null,null,"Universal Send (同報送信)の呼び出し",null,null,null,null,"","","","","",1,6,27,"FNC-001-6027",44,"Scanner ",null,"O","O",null,null,"Recall Universal Send (broadcasting)",null,null,"Scanner ",null,"O","O",null,null,"Recall Universal Send (broadcasting)"]
[1,6,28,"FNC-001-6028",45,"スキャナ編",null,"○","○",null,null,"登録宛先使用時の排他制御",null,null,null,null,"","","","","",1,6,28,"FNC-001-6028",45,"Scanner ",null,"O","O",null,null,"Exclusive access control when the registered destination in use",null,null,"Scanner ",null,"O","O",null,null,"Exclusive access control when the registered destination in use"]
[1,6,29,"FNC-001-6029",46,"スキャナ編",null,"○","○",null,null,"配信方式設定",null,null,null,null,"","","","","",1,6,29,"FNC-001-6029",46,"Scanner ",null,"O","O",null,null,"Setting of transmission method ",null,null,"Scanner ",null,"O","O",null,null,"Setting of transmission method "]
[1,6,30,"FNC-001-6030",47,"スキャナ編",null,"○","○",null,null,"配信データ形式",null,null,null,null,"","","","","",1,6,30,"FNC-001-6030",47,"Scanner ",null,"O","O",null,null,"Data transmission format ",null,null,"Scanner ",null,"O","O",null,null,"Data transmission format "]
[1,6,31,"FNC-001-6031",48,"スキャナ編",null,"○","○",null,null,"配信ファイル名",null,null,null,null,"","","","","",1,6,31,"FNC-001-6031",48,"Scanner ",null,"O","O",null,null,"Transmission file name ",null,null,"Scanner ",null,"O","O",null,null,"Transmission file name "]
[1,6,31,0,null,"スキャナ編",null,"○","○",null,"§１．６．３．　メール配信設定(ScanToE-mail, I-FAX)",null,null,null,null,null,"","","","","",1,6,31,0,null,"Scanner ",null,"O","O",null,"§１．６．３．　メール配信設定(ScanToE-mail, I-FAX)",null,null,null,"Scanner ",null,"O","O",null,"1.6.3.   Setting of mail transmission  ( ScanToE-mail, I-Fax) "]
[1,6,32,"FNC-001-6032",49,"スキャナ編",null,"○","○",null,null,"メールアドレス入力(To)",null,null,null,null,"","","","","",1,6,32,"FNC-001-6032",49,"Scanner ",null,"O","O",null,null,"Entry of mail address (To)",null,null,"Scanner ",null,"O","O",null,null,"Entry of mail address (To)"]
[1,6,33,"FNC-001-6033",50,"スキャナ編",null,"○","○",null,null,"差出人メールアドレス入力(From)",null,null,null,null,"","","","","",1,6,33,"FNC-001-6033",50,"Scanner ",null,"O","O",null,null,"Entry of sender mail address (From)",null,null,"Scanner ",null,"O","O",null,null,"Entry of sender mail address (From)"]
[1,6,34,"FNC-001-6034",51,"スキャナ編",null,"○","○",null,null,"件名入力(Subject)",null,null,null,null,"","","","","",1,6,34,"FNC-001-6034",51,"Scanner ",null,"O","O",null,null,"Subject entry (Subject)",null,null,"Scanner ",null,"O","O",null,null,"Subject entry (Subject)"]
[1,6,35,"FNC-001-6035",52,"スキャナ編",null,"○","○",null,null,"本文入力(Body)",null,null,null,null,"","","","","",1,6,35,"FNC-001-6035",52,"Scanner ",null,"O","O",null,null,"Body entry",null,null,"Scanner ",null,"O","O",null,null,"Body entry"]
[1,6,36,"FNC-001-6036",53,"スキャナ編",null,"○","○",null,null,"ファイル添付設定",null,null,null,1,"0001",0,0,0,1,1,6,36,"FNC-001-6036",53]
[1,6,36,0,null,"スキャナ編",null,"○","○",null,"§１．６．４．　FTP配信設定(ScanToFTP)",null,null,null,null,null,{"$f":"IF(P68=\"\",\"\",DEC2BIN(P68,4))","v":""},{"$f":"IF($Q68=\"\",\"\",VALUE(MID($Q68,1,1)))","v":""},{"$f":"IF($Q68=\"\",\"\",VALUE(MID($Q68,2,1)))","v":""},{"$f":"IF($Q68=\"\",\"\",VALUE(MID($Q68,3,1)))","v":""},{"$f":"IF($Q68=\"\",\"\",VALUE(MID($Q68,4,1)))","v":""},1,6,36,0,null,"Scanner ",null,"O","O",null,"§１．６．４．　FTP配信設定(ScanToFTP)",null,null,null,"Scanner ",null,"O","O",null,"1.6.4.   Setting of FTP transmission  ( Scan ToFTP)"]
[1,6,37,"FNC-001-6037",54,"スキャナ編",null,"○","○",null,null,"FTP配信入力",null,null,null,null,"","","","","",1,6,37,"FNC-001-6037",54,"Scanner ",null,"O","O",null,null,"Entry of FTP transmission",null,null,"Scanner ",null,"O","O",null,null,"Entry of FTP transmission"]
[1,6,38,"FNC-001-6038",55,"スキャナ編",null,"○","○",null,null,"URL通知(FTP)設定",null,null,null,null,"","","","","",1,6,38,"FNC-001-6038",55,"Scanner ",null,"O","O",null,null,"Setting of URL (FTP) notification ",null,null,"Scanner ",null,"O","O",null,null,"Setting of URL (FTP) notification "]
[1,6,39,"FNC-001-6039",56,"スキャナ編",null,"○","○",null,null,"URL通知(FTP) E-mailアドレス設定(To)",null,null,null,null,"","","","","",1,6,39,"FNC-001-6039",56,"Scanner ",null,"O","O",null,null,"Setting URL (FTP) notification and E-mail address",null,null,"Scanner ",null,"O","O",null,null,"Setting URL (FTP) notification and E-mail address"]
[{"$f":"IF(K72<>\"\",IF(MID(K72,FIND(\"．\",K72,1)+1,1)=\"　\",A71+1,A71),A71)","v":1},{"$f":"IF($K72<>\"\",IF(A71<>A72,0,IF(MID($K72,FIND(\"．\",$K72,1)+1,1)<>\"　\",IF(MID($K72,FIND(\"．\",$K72,FIND(\"．\",$K72,1)+1)+1,1)=\"　\",B71+1,B71),B71)),B71)","v":6},{"$f":"IF(K72<>\"\",IF(AND(A71=A72,B71=B72),C71,0),C71+1)","v":40},{"$f":"IF(K72<>\"\",0,CONCATENATE(IF(A72>9,\"FNC-0\",\"FNC-00\"),TEXT(A72,\"0\"),\"-\",TEXT(B72,\"0\"),IF(C72>9,\"0\",\"00\"),TEXT(C72,\"0\")))","v":"FNC-001-6040"},{"$f":"IF(E71<>\"\",E71+1,IF(E70<>\"\",E70+1,IF(E69<>\"\",E69+1,E68+1)))","v":57},"スキャナ編",null,"○","○",null,null,"URL通知(FTP) Subject設定",null,null,null,null,"","","","","",{"$f":"IF(AF72<>\"\",IF(MID(AF72,FIND(\"．\",AF72,1)+1,1)=\"　\",V71+1,V71),V71)","v":1},{"$f":"IF($K72<>\"\",IF(V71<>V72,0,IF(MID($K72,FIND(\"．\",$K72,1)+1,1)<>\"　\",IF(MID($K72,FIND(\"．\",$K72,FIND(\"．\",$K72,1)+1)+1,1)=\"　\",W71+1,W71),W71)),W71)","v":6},{"$f":"IF(AF72<>\"\",IF(AND(V71=V72,W71=W72),X71,0),X71+1)","v":40},{"$f":"IF(AF72<>\"\",0,CONCATENATE(IF(V72>9,\"FNC-0\",\"FNC-00\"),TEXT(V72,\"0\"),\"-\",TEXT(W72,\"0\"),IF(X72>9,\"0\",\"00\"),TEXT(X72,\"0\")))","v":"FNC-001-6040"},{"$f":"IF(Z71<>\"\",Z71+1,IF(Z70<>\"\",Z70+1,IF(Z69<>\"\",Z69+1,Z68+1)))","v":57},"Scanner ",null,"O","O",null,null,"Setting of URL (FTP) notification and subject ",null,null,"Scanner ",null,"O","O",null,null,"Setting of URL (FTP) notification and subject "]
[1,6,41,"FNC-001-6041",58,"スキャナ編",null,"○","○",null,null,"URL通知(FTP) 本文設定",null,null,null,null,"","","","","",1,6,41,"FNC-001-6041",58,"Scanner ",null,"O","O",null,null,"Setting ofURL(FTP) notification and body ",null,null,"Scanner ",null,"O","O",null,null,"Setting ofURL(FTP) notification and body "]
[1,6,41,0,null,"スキャナ編",null,"○","○",null,"§１．６．５．　Box蓄積設定(ScanToBox)",null,null,null,null,null,"","","","","",1,6,41,0,null,"Scanner ",null,"O","O",null,"§１．６．５．　Box蓄積設定(ScanToBox)",null,null,null,"Scanner ",null,"O","O",null,"1.6.5.   Setting of Box stored image (Scan ToBOX)"]
[1,6,42,"FNC-001-6042",59,"スキャナ編",null,"○","○",null,null,"ボックスの指定",null,null,null,null,"","","","","",1,6,42,"FNC-001-6042",59,"Scanner ",null,"O","O",null,null,"Specification of Box",null,null,"Scanner ",null,"O","O",null,null,"Specification of Box"]
[1,6,43,"FNC-001-6043",60,"スキャナ編",null,"○","○",null,null,"URL通知(Box)設定",null,null,null,null,"","","","","",1,6,43,"FNC-001-6043",60,"Scanner ",null,"O","O",null,null,"Setting of URL notification (Box) ",null,null,"Scanner ",null,"O","O",null,null,"Setting of URL notification (Box) "]
[1,6,44,"FNC-001-6044",61,"スキャナ編",null,"○","○",null,null,"URL通知(Box) E-mailアドレス設定(To)",null,null,null,null,"","","","","",1,6,44,"FNC-001-6044",61,"Scanner ",null,"O","O",null,null,"URL notification (Box) for setting E-mail address",null,null,"Scanner ",null,"O","O",null,null,"URL notification (Box) for setting E-mail address"]
[1,6,45,"FNC-001-6045",62,"スキャナ編",null,"○","○",null,null,"URL通知(Box) Subject設定",null,null,null,null,"","","","","",1,6,45,"FNC-001-6045",62,"Scanner ",null,"O","O",null,null,"URL notification  (Box) for setting Subject",null,null,"Scanner ",null,"O","O",null,null,"URL notification  (Box) for setting Subject"]
[1,6,46,"FNC-001-6046",63,"スキャナ編",null,"○","○",null,null,"URL通知(Box) 本文設定",null,null,null,null,"","","","","",1,6,46,"FNC-001-6046",63,"Scanner ",null,"O","O",null,null,"URL notification (Box) for setting body ",null,null,"Scanner ",null,"O","O",null,null,"URL notification (Box) for setting body "]
[1,6,46,0,null,"スキャナ編",null,"○","○",null,"§１．６．６．　SMB配信設定(ScanToPC)",null,null,null,null,null,"","","","","",1,6,46,0,null,"Scanner ",null,"O","O",null,"§１．６．６．　SMB配信設定(ScanToPC)",null,null,null,"Scanner ",null,"O","O",null,"1.6.5  Setting of SMB transmission (ScanToPC)"]
[1,6,47,"FNC-001-6047",64,"スキャナ編",null,"○","○",null,null,"SMB配信入力",null,null,null,null,"","","","","",1,6,47,"FNC-001-6047",64,"Scanner ",null,"O","O",null,null,"Entry of SMB transmission",null,null,"Scanner ",null,"O","O",null,null,"Entry of SMB transmission"]
[1,6,48,"FNC-001-6048",65,"スキャナ編",null,"○","○",null,null,"URL通知(SMB)設定",null,null,null,null,"","","","","",1,6,48,"FNC-001-6048",65,"Scanner ",null,"O","O",null,null,"Setting of URL (SMB) notification",null,null,"Scanner ",null,"O","O",null,null,"Setting of URL (SMB) notification"]
[1,6,49,"FNC-001-6049",66,"スキャナ編",null,"○","○",null,null,"URL通知(SMB) E-mailアドレス設定(To)",null,null,null,null,"","","","","",1,6,49,"FNC-001-6049",66,"Scanner ",null,"O","O",null,null,"URL (SMB) notification for E-mail address (To) setting ",null,null,"Scanner ",null,"O","O",null,null,"URL (SMB) notification for E-mail address (To) setting "]
[1,6,50,"FNC-001-6050",67,"スキャナ編",null,"○","○",null,null,"URL通知(SMB) Subject設定",null,null,null,null,"","","","","",1,6,50,"FNC-001-6050",67,"Scanner ",null,"O","O",null,null,"URL (SMB) notification for Subject setting ",null,null,"Scanner ",null,"O","O",null,null,"URL (SMB) notification for Subject setting "]
[1,6,51,"FNC-001-6051",68,"スキャナ編",null,"○","○",null,null,"URL通知(SMB) 本文設定",null,null,null,null,"","","","","",1,6,51,"FNC-001-6051",68,"Scanner ",null,"O","O",null,null,"URL (SMB) notification for Body setting ",null,null,"Scanner ",null,"O","O",null,null,"URL (SMB) notification for Body setting "]
[1,6,51,0,null,"スキャナ編",null,null,null,null,"§１．６．７．　WebDav配信設定(ScanToWebDav)",null,null,null,null,null,"","","","","",1,6,51,0,null,"Scanner ",null,null,null,null,"§１．６．７．　WebDav配信設定(ScanToWebDav)",null,null,null,"Scanner ",null,null,null,null,"1.6.7. WebDav transmission setting (ScanToWebDav)"]
[1,6,52,"FNC-001-6052",69,"スキャナ編",null,null,null,null,null,"WebDav配信入力",null,null,null,null,"","","","","",1,6,52,"FNC-001-6052",69,"Scanner ",null,null,null,null,null,"Entry of WebDav transmission  ",null,null,"Scanner ",null,null,null,null,null,"Entry of WebDav transmission  "]
[1,6,53,"FNC-001-6053",70,"スキャナ編",null,null,null,null,null,"URL通知(WebDav)設定",null,null,null,null,"","","","","",1,6,53,"FNC-001-6053",70,"Scanner ",null,null,null,null,null,"Setting of URL notification (WebDav) ",null,null,"Scanner ",null,null,null,null,null,"Setting of URL notification (WebDav) "]
[1,6,54,"FNC-001-6054",71,"スキャナ編",null,null,null,null,null,"URL通知(WebDav) E-mailアドレス設定(To)",null,null,null,null,"","","","","",1,6,54,"FNC-001-6054",71,"Scanner ",null,null,null,null,null,"URL notification (WebDav) for E-mail address setting (To) ",null,null,"Scanner ",null,null,null,null,null,"URL notification (WebDav) for E-mail address setting (To) "]
[1,6,55,"FNC-001-6055",72,"スキャナ編",null,null,null,null,null,"URL通知(WebDav) Subject設定",null,null,null,null,"","","","","",1,6,55,"FNC-001-6055",72,"Scanner ",null,null,null,null,null,"URL notification (WebDav) for setting Subject",null,null,"Scanner ",null,null,null,null,null,"URL notification (WebDav) for setting Subject"]
[1,6,56,"FNC-001-6056",73,"スキャナ編",null,null,null,null,null,"URL通知(WebDav) 本文設定",null,null,null,null,"","","","","",1,6,56,"FNC-001-6056",73,"Scanner ",null,null,null,null,null,"URL notification (WebDav) for setting Body",null,null,"Scanner ",null,null,null,null,null,"URL notification (WebDav) for setting Body"]
[1,6,56,0,null,"スキャナ編",null,null,null,null,"§１．６．８．外部メモリー宛先設定(ScanToUSB)",null,null,null,null,1,"0001",0,0,0,1,1,6,56,0,null,null,null,null,null,null,"§１．６．８．外部メモリー宛先設定(ScanToUSB)"]
[1,6,57,"FNC-001-6057",74,"スキャナ編",null,null,null,null,null,"外部メモリー宛先直接入力",null,null,null,1,"0001",0,0,0,1,1,6,57,"FNC-001-6057",74]
[1,6,57,0,null,"スキャナ編",null,"○","○",null,"§１．７．１　登録設定",null,null,null,null,null,"","","","","",1,6,57,0,null,"Scanner ",null,"O","O",null,"§１．７．１　登録設定",null,null,null,"Scanner ",null,"O","O",null,"1.7.1.  Registration of setting"]
[1,6,58,"FNC-001-6058",75,"スキャナ編",null,"○","○",null,null,"インデックス登録",null,null,null,null,"","","","","",1,6,58,"FNC-001-6058",75,"Scanner ",null,"O","O",null,null,"Index registration",null,null,"Scanner ",null,"O","O",null,null,"Index registration"]
[1,6,59,"FNC-001-6059",76,"スキャナ編",null,"○","○",null,null,"短縮宛先登録",null,null,null,null,"","","","","",1,6,59,"FNC-001-6059",76,"Scanner ",null,"O","O",null,null,"Address book registration",null,null,"Scanner ",null,"O","O",null,null,"Address book registration"]
[1,6,60,"FNC-001-6060",77,"スキャナ編",null,"○","○",null,null,"グループ宛先登録",null,null,null,null,"","","","","",1,6,60,"FNC-001-6060",77,"Scanner ",null,"O","O",null,null,"Group destination registration ",null,null,"Scanner ",null,"O","O",null,null,"Group destination registration "]
[1,6,61,"FNC-001-6061",78,"スキャナ編",null,"○","○",null,null,"プログラムキー登録",null,null,null,null,"","","","","",1,6,61,"FNC-001-6061",78,"Scanner ",null,"O","O",null,null,"Program key registration",null,null,"Scanner ",null,"O","O",null,null,"Program key registration"]
[1,6,62,"FNC-001-6062",79,"スキャナ編",null,"○","○",null,null,"一時配信設定登録",null,null,null,null,"","","","","",1,6,62,"FNC-001-6062",79,"Scanner ",null,"O","O",null,null,"Temporary one-touch setting registration",null,null,"Scanner ",null,"O","O",null,null,"Temporary one-touch setting registration"]
[1,6,63,"FNC-001-6063",80,"スキャナ編",null,"○","○",null,null,"HotKey機能",null,null,null,null,"","","","","",1,6,63,"FNC-001-6063",80,"Scanner ",null,"O","O",null,null,"HotKey function ",null,null,"Scanner ",null,"O","O",null,null,"HotKey function "]
[1,6,64,"FNC-001-6064",81,"スキャナ編",null,"○","○",null,null,"初期モード登録",null,null,null,null,"","","","","",1,6,64,"FNC-001-6064",81,"Scanner ",null,"O","O",null,null,"Initial mode registration ",null,null,"Scanner ",null,"O","O",null,null,"Initial mode registration "]
[1,6,65,"FNC-001-6065",82,"スキャナ編",null,"○","○",null,null,"宛先のダウンロード",null,null,null,null,"","","","","",1,6,65,"FNC-001-6065",82,"Scanner ",null,"O","O",null,null,"Downloading of destination",null,null,"Scanner ",null,"O","O",null,null,"Downloading of destination"]
[1,6,65,0,null,"スキャナ編",null,"○","○",null,"§１．７．2　メール配信設定",null,null,null,null,null,"","","","","",1,6,65,0,null,"Scanner ",null,"O","O",null,"§１．７．2　メール配信設定",null,null,null,"Scanner ",null,"O","O",null,"1.7.2.  Setting of E-mail transmission "]
[1,6,66,"FNC-001-6066",83,"スキャナ編",null,"○","○",null,null,"E-mail送信(SMTP)設定",null,null,null,null,"","","","","",1,6,66,"FNC-001-6066",83,"Scanner ",null,"O","O",null,null,"Setting of E-mail sending (SMTP)",null,null,"Scanner ",null,"O","O",null,null,"Setting of E-mail sending (SMTP)"]
[1,6,67,"FNC-001-6067",84,"スキャナ編",null,"○","○",null,null,"SMTPサーバ",null,null,null,null,"","","","","",1,6,67,"FNC-001-6067",84,"Scanner ",null,"O","O",null,null,"SMTP server",null,null,"Scanner ",null,"O","O",null,null,"SMTP server"]
[1,6,68,"FNC-001-6068",85,"スキャナ編",null,"○","○",null,null,"バイナリ分割",null,null,null,null,"","","","","",1,6,68,"FNC-001-6068",85,"Scanner ",null,"O","O",null,null,"Binary divide",null,null,"Scanner ",null,"O","O",null,null,"Binary divide"]
[1,6,69,"FNC-001-6069",86,"スキャナ編",null,"○","○",null,null,"SMTPサーバ接続タイムアウト",null,null,null,null,"","","","","",1,6,69,"FNC-001-6069",86,"Scanner ",null,"O","O",null,null,"SMTP server connection timeout",null,null,"Scanner ",null,"O","O",null,null,"SMTP server connection timeout"]
[1,6,70,"FNC-001-6070",87,"スキャナ編",null,"○","○",null,null,"SMTPサーバ容量",null,null,null,null,"","","","","",1,6,70,"FNC-001-6070",87,"Scanner ",null,"O","O",null,null,"SMTP server capacity ",null,null,"Scanner ",null,"O","O",null,null,"SMTP server capacity "]
[1,6,71,"FNC-001-6071",88,"スキャナ編",null,"○","○",null,null,"SMTPサーバポート番号",null,null,null,null,"","","","","",1,6,71,"FNC-001-6071",88,"Scanner ",null,"O","O",null,null,"SMTP server port number ",null,null,"Scanner ",null,"O","O",null,null,"SMTP server port number "]
[1,6,72,"FNC-001-6072",89,"スキャナ編",null,"○","○",null,null,"差出人アドレス(From)",null,null,null,null,"","","","","",1,6,72,"FNC-001-6072",89,"Scanner ",null,"O","O",null,null,"Sender address (From)",null,null,"Scanner ",null,"O","O",null,null,"Sender address (From)"]
[1,6,73,"FNC-001-6073",90,"スキャナ編",null,"○","○",null,null,"ページ分割",null,null,null,1,"0001",0,0,0,1,1,6,73,"FNC-001-6073",90,null,null,"O","O",null,null,"ページ分割",null,null,null,null,"O","O",null,null,"ページ分割"]
[1,6,74,"FNC-001-6074",91,"スキャナ編",null,"○","○",null,null,"認証設定",null,null,null,null,"","","","","",1,6,74,"FNC-001-6074",91,"Scanner ",null,"O","O",null,null,"Setting of authentication ",null,null,"Scanner ",null,"O","O",null,null,"Setting of authentication "]
[1,6,75,"FNC-001-6075",92,"スキャナ編",null,"○","○",null,null,"POP before SMTP設定",null,null,null,null,"","","","","",1,6,75,"FNC-001-6075",92,"Scanner ",null,"O","O",null,null,"POP before SMTP setting ",null,null,"Scanner ",null,"O","O",null,null,"POP before SMTP setting "]
[1,6,76,"FNC-001-6076",93,"スキャナ編",null,"○","○",null,null,"SMTP認証設定（UserID)",null,null,null,null,"","","","","",1,6,76,"FNC-001-6076",93,"Scanner ",null,"O","O",null,null,"Setting of SMTP for authentication (User ID) ",null,null,"Scanner ",null,"O","O",null,null,"Setting of SMTP for authentication (User ID) "]
[1,6,77,"FNC-001-6077",94,"スキャナ編",null,"○","○",null,null,"SMTP認証設定（Password)",null,null,null,null,"","","","","",1,6,77,"FNC-001-6077",94,"Scanner ",null,"O","O",null,null,"Setting of SMTP for authentication (Password)",null,null,"Scanner ",null,"O","O",null,null,"Setting of SMTP for authentication (Password)"]
[1,6,78,"FNC-001-6078",95,"スキャナ編",null,"○","○",null,null,"SMTP認証設定（Realm)",null,null,null,null,"","","","","",1,6,78,"FNC-001-6078",95,"Scanner ",null,"O","O",null,null,"Setting of SMTP for authentication (Realm)",null,null,"Scanner ",null,"O","O",null,null,"Setting of SMTP for authentication (Realm)"]
[1,6,78,0,null,"スキャナ編",null,"○","○",null,"§１．７．3 FTP配信設定",null,null,null,null,null,"","","","","",1,6,78,0,null,"Scanner ",null,"O","O",null,"§１．７．3 FTP配信設定",null,null,null,"Scanner ",null,"O","O",null,"1.7.3. Setting of FTP transmission "]
[1,6,79,"FNC-001-6079",96,"スキャナ編",null,"○","○",null,null,"プロキシサーバのホスト名",null,null,null,null,"","","","","",1,6,79,"FNC-001-6079",96,"Scanner ",null,"O","O",null,null,"Proxy server host name",null,null,"Scanner ",null,"O","O",null,null,"Proxy server host name"]
[1,6,80,"FNC-001-6080",97,"スキャナ編",null,"○","○",null,null,"プロキシサーバポート番号",null,null,null,null,"","","","","",1,6,80,"FNC-001-6080",97,"Scanner ",null,"O","O",null,null,"Proxy server port name ",null,null,"Scanner ",null,"O","O",null,null,"Proxy server port name "]
[1,6,81,"FNC-001-6081",98,"スキャナ編",null,"○","○",null,null,"FTP サーバ接続タイムアウト",null,null,null,null,"","","","","",1,6,81,"FNC-001-6081",98,"Scanner ",null,"O","O",null,null,"FTP server connection timeout",null,null,"Scanner ",null,"O","O",null,null,"FTP server connection timeout"]
[1,6,81,0,null,"スキャナ編",null,null,null,null,"§１．７．4 WebDav配信設定",null,null,null,null,null,"","","","","",1,6,81,0,null,"Scanner ",null,null,null,null,"§１．７．4 WebDav配信設定",null,null,null,"Scanner ",null,null,null,null,"1.7.4  Setting of WebDav transmission "]
[1,6,82,"FNC-001-6082",99,"スキャナ編",null,null,null,null,null,"プロキシサーバのホスト名",null,null,null,null,"","","","","",1,6,82,"FNC-001-6082",99,"Scanner ",null,null,null,null,null,"Proxy server host name",null,null,"Scanner ",null,null,null,null,null,"Proxy server host name"]
[1,6,83,"FNC-001-6083",100,"スキャナ編",null,null,null,null,null,"プロキシサーバポート番号",null,null,null,null,"","","","","",1,6,83,"FNC-001-6083",100,"Scanner ",null,null,null,null,null,"Proxy server port name ",null,null,"Scanner ",null,null,null,null,null,"Proxy server port name "]
[1,6,84,"FNC-001-6084",101,"スキャナ編",null,null,null,null,null,"WebDav サーバ接続タイムアウト",null,null,null,null,"","","","","",1,6,84,"FNC-001-6084",101,"Scanner ",null,null,null,null,null," WebDav server connection timeout",null,null,"Scanner ",null,null,null,null,null," WebDav server connection timeout"]
[1,6,84,0,null,"スキャナ編",null,"○","○",null,"§１．７．5  その他の設定",null,null,null,null,null,"","","","","",1,6,84,0,null,"Scanner ",null,"O","O",null,"§１．７．5  その他の設定",null,null,null,"Scanner ",null,"O","O",null,"1.7.5  Other settings "]
[1,6,85,"FNC-001-6085",102,"スキャナ編",null,"○","○",null,null,"オートリセット",null,null,null,null,"","","","","",1,6,85,"FNC-001-6085",102,"Scanner ",null,"O","O",null,null,"Auto reset",null,null,"Scanner ",null,"O","O",null,null,"Auto reset"]
[1,6,86,"FNC-001-6086",103,"スキャナ編",null,"○","○",null,null,"キーカウンタ無し時の動作",null,null,null,null,"","","","","",1,6,86,"FNC-001-6086",103,"Scanner ",null,"O","O",null,null,"Performance in case of no key counter ",null,null,"Scanner ",null,"O","O",null,null,"Performance in case of no key counter "]
[1,6,87,"FNC-001-6087",104,"スキャナ編",null,"○","○",null,null,"基本画面表示モード",null,null,null,null,"","","","","",1,6,87,"FNC-001-6087",104,"Scanner ",null,"O","O",null,null,"Basic screen display mode",null,null,"Scanner ",null,"O","O",null,null,"Basic screen display mode"]
[1,6,88,"FNC-001-6088",105,"スキャナ編",null,"○","○",null,null,"検索文字",null,null,null,null,"","","","","",1,6,88,"FNC-001-6088",105,"Scanner ",null,"O","O",null,null,"Search character",null,null,"Scanner ",null,"O","O",null,null,"Search character"]
[1,6,89,"FNC-001-6089",106,"スキャナ編",null,"○","○",null,null,"送信後設定解除",null,null,null,null,"","","","","",1,6,89,"FNC-001-6089",106,"Scanner ",null,"O","O",null,null,"Deletion of setting after transmission",null,null,"Scanner ",null,"O","O",null,null,"Deletion of setting after transmission"]
[1,6,90,"FNC-001-6090",107,"スキャナ編",null,"○","○",null,null,"登録ボタン消去設定",null,null,null,null,"","","","","",1,6,90,"FNC-001-6090",107,"Scanner ",null,"O","O",null,null,"Setting of deletion of registration button",null,null,"Scanner ",null,"O","O",null,null,"Setting of deletion of registration button"]
[1,6,91,"FNC-001-6091",108,"スキャナ編",null,"○","○",null,null,"Box(lifetime of files in Box)",null,null,null,null,{"$f":"IF(P132=\"\",\"\",DEC2BIN(P132,4))","v":""},{"$f":"IF($Q132=\"\",\"\",VALUE(MID($Q132,1,1)))","v":""},{"$f":"IF($Q132=\"\",\"\",VALUE(MID($Q132,2,1)))","v":""},{"$f":"IF($Q132=\"\",\"\",VALUE(MID($Q132,3,1)))","v":""},{"$f":"IF($Q132=\"\",\"\",VALUE(MID($Q132,4,1)))","v":""},1,6,91,"FNC-001-6091",108,"Scanner ",null,"O","O",null,null,"Box (lifetime of files in Box)",null,null,"Scanner ",null,"O","O",null,null,"Box (lifetime of files in Box)"]
[1,6,92,"FNC-001-6092",109,"スキャナ編",null,"○","○",null,null,"Monochrome Binary Image Compression",null,null,null,null,"","","","","",1,6,92,"FNC-001-6092",109,"Scanner ",null,"O","O",null,null,"Monochrome Binary Image Compression",null,null,"Scanner ",null,"O","O",null,null,"Monochrome Binary Image Compression"]
[1,6,93,"FNC-001-6093",110,"スキャナ編",null,"○","○",null,null,"JPEG Image Quality",null,null,null,null,"","","","","",1,6,93,"FNC-001-6093",110,"Scanner ",null,"O","O",null,null,"JPEG Image Quality",null,null,"Scanner ",null,"O","O",null,null,"JPEG Image Quality"]
[1,6,94,"FNC-001-6094",111,"スキャナ編",null,"○","○",null,null,"TWAIN Panel Lock Timeout",null,null,null,null,"","","","","",1,6,94,"FNC-001-6094",111,"Scanner ",null,"O","O",null,null,"TWAIN Panel Lock Timeout",null,null,"Scanner ",null,"O","O",null,null,"TWAIN Panel Lock Timeout"]
[{"$f":"IF(K136<>\"\",IF(MID(K136,FIND(\"．\",K136,1)+1,1)=\"　\",A135+1,A135),A135)","v":1},{"$f":"IF($K136<>\"\",IF(A135<>A136,0,IF(MID($K136,FIND(\"．\",$K136,1)+1,1)<>\"　\",IF(MID($K136,FIND(\"．\",$K136,FIND(\"．\",$K136,1)+1)+1,1)=\"　\",B135+1,B135),B135)),B135)","v":6},{"$f":"IF(K136<>\"\",IF(AND(A135=A136,B135=B136),C135,0),C135+1)","v":95},{"$f":"IF(K136<>\"\",0,CONCATENATE(IF(A136>9,\"FNC-0\",\"FNC-00\"),TEXT(A136,\"0\"),\"-\",TEXT(B136,\"0\"),IF(C136>9,\"0\",\"00\"),TEXT(C136,\"0\")))","v":"FNC-001-6095"},{"$f":"IF(E135<>\"\",E135+1,IF(E134<>\"\",E134+1,IF(E133<>\"\",E133+1,E132+1)))","v":112},"スキャナ編",null,"○","○",null,null,"Device Name",null,null,null,null,"","","","","",{"$f":"IF(AF136<>\"\",IF(MID(AF136,FIND(\"．\",AF136,1)+1,1)=\"　\",V135+1,V135),V135)","v":1},{"$f":"IF($K136<>\"\",IF(V135<>V136,0,IF(MID($K136,FIND(\"．\",$K136,1)+1,1)<>\"　\",IF(MID($K136,FIND(\"．\",$K136,FIND(\"．\",$K136,1)+1)+1,1)=\"　\",W135+1,W135),W135)),W135)","v":6},{"$f":"IF(AF136<>\"\",IF(AND(V135=V136,W135=W136),X135,0),X135+1)","v":95},{"$f":"IF(AF136<>\"\",0,CONCATENATE(IF(V136>9,\"FNC-0\",\"FNC-00\"),TEXT(V136,\"0\"),\"-\",TEXT(W136,\"0\"),IF(X136>9,\"0\",\"00\"),TEXT(X136,\"0\")))","v":"FNC-001-6095"},{"$f":"IF(Z135<>\"\",Z135+1,IF(Z134<>\"\",Z134+1,IF(Z133<>\"\",Z133+1,Z132+1)))","v":112},"Scanner ",null,"O","O",null,null,"Device Name",null,null,"Scanner ",null,"O","O",null,null,"Device Name"]
[1,6,96,"FNC-001-6096",113,"スキャナ編",null,"○","○",null,null,"Time Zone",null,null,null,null,"","","","","",1,6,96,"FNC-001-6096",113,"Scanner ",null,"O","O",null,null,"Time Zone",null,null,"Scanner ",null,"O","O",null,null,"Time Zone"]
[1,6,96,0,null,"スキャナ編",null,"○","○",null,"§１．７．5  機能有効設定",null,null,null,null,null,"","","","","",1,6,96,0,null,"Scanner ",null,"O","O",null,"§１．７．5  機能有効設定",null,null,null,"Scanner ",null,"O","O",null,"1.7.5.  Setting for enabling functions "]
[1,6,97,"FNC-001-6097",114,"スキャナ編",null,"○","○",null,null,"Scan to E-mail機能有効設定",null,null,null,null,"","","","","",1,6,97,"FNC-001-6097",114,"スキャナ編",null,"O","O",null,null,"Scan to E-mail機能有効設定",null,null,"スキャナ編",null,"O","O",null,null,"Scan to E-mail機能有効設定"]
[1,6,98,"FNC-001-6098",115,"スキャナ編",null,"○","○",null,null,"Scan to FTP機能有効設定",null,null,null,null,"","","","","",1,6,98,"FNC-001-6098",115,"スキャナ編",null,"O","O",null,null,"Scan to FTP機能有効設定",null,null,"スキャナ編",null,"O","O",null,null,"Scan to FTP機能有効設定"]
[1,6,99,"FNC-001-6099",116,"スキャナ編",null,"○","○",null,null,"Scan to PC機能有効設定",null,null,null,null,"","","","","",1,6,99,"FNC-001-6099",116,"スキャナ編",null,"O","O",null,null,"Scan to PC機能有効設定",null,null,"スキャナ編",null,"O","O",null,null,"Scan to PC機能有効設定"]
[1,6,100,"FNC-001-60100",117,"スキャナ編",null,"○","○",null,null,"Scan to Box機能有効設定",null,null,null,null,"","","","","",1,6,100,"FNC-001-60100",117,"スキャナ編",null,"O","O",null,null,"Scan to Box機能有効設定",null,null,"スキャナ編",null,"O","O",null,null,"Scan to Box機能有効設定"]
[1,6,101,"FNC-001-60101",118,"スキャナ編",null,"○","○",null,null,"HDD TWAIN機能有効設定",null,null,null,null,"","","","","",1,6,101,"FNC-001-60101",118,"スキャナ編",null,"O","O",null,null,"HDD TWAIN機能有効設定",null,null,"スキャナ編",null,"O","O",null,null,"HDD TWAIN機能有効設定"]
[1,6,102,"FNC-001-60102",119,"スキャナ編",null,"○","○",null,null,"Real Mode TWAIN機能有効設定",null,null,null,null,"","","","","",1,6,102,"FNC-001-60102",119,"スキャナ編",null,"O","O",null,null,"Real Mode TWAIN機能有効設定",null,null,"スキャナ編",null,"O","O",null,null,"Real Mode TWAIN機能有効設定"]
[1,7,0,0,null,"スキャナ編",null,"○","○",null,"§１．８．　トラブル・エラー関連",null,null,null,null,null,"","","","","",1,7,0,0,null,"Scanner ",null,"O","O",null,"§１．８．　トラブル・エラー関連",null,null,null,"Scanner ",null,"O","O",null,"1.8.     Relating to trouble/error "]
[1,7,1,"FNC-001-7001",120,"スキャナ編",null,"○","○",null,null,"本体起動スキャンで発生する警告一覧",null,null,null,null,"","","","","",1,7,1,"FNC-001-7001",120,"Scanner ",null,"O","O",null,null,"List of warning caused by the main unit start-up scan",null,null,"Scanner ",null,"O","O",null,null,"List of warning caused by the main unit start-up scan"]
[1,7,2,"FNC-001-7002",121,"スキャナ編",null,"○","○",null,null,"PC起動スキャンで発生する警告一覧",null,null,null,null,"","","","","",1,7,2,"FNC-001-7002",121,"Scanner ",null,"O","O",null,null,"List of warning caused by PC start-up scan ",null,null,"Scanner ",null,"O","O",null,null,"List of warning caused by PC start-up scan "]
[1,7,3,"FNC-001-7003",122,"スキャナ編",null,"○","○",null,null,"原稿戻し枚数警告1(CAUTION)",null,null,null,null,"","","","","",1,7,3,"FNC-001-7003",122,"Scanner ",null,"O","O",null,null,"Warning for the number of copies to be put back 1 (CAUTION)",null,null,"Scanner ",null,"O","O",null,null,"Warning for the number of copies to be put back 1 (CAUTION)"]
[1,7,4,"FNC-001-7004",123,"スキャナ編",null,"○","○",null,null,"原稿サイズ検出エラー",null,null,null,null,"","","","","",1,7,4,"FNC-001-7004",123,"Scanner ",null,"O","O",null,null,"Original size detection error ",null,null,"Scanner ",null,"O","O",null,null,"Original size detection error "]
[1,7,5,"FNC-001-7005",124,"スキャナ編",null,"○","○",null,null,"原稿台原稿セット要求(ERROR1)",null,null,null,null,"","","","","",1,7,5,"FNC-001-7005",124,"Scanner ",null,"O","O",null,null,"Command to set originals on ADF (ERROR 1)",null,null,"Scanner ",null,"O","O",null,null,"Command to set originals on ADF (ERROR 1)"]
[1,7,6,"FNC-001-7006",125,"スキャナ編",null,"○","○",null,null,"原稿戻し枚数警告2(ERROR1)",null,null,null,null,"","","","","",1,7,6,"FNC-001-7006",125,"Scanner ",null,"O","O",null,null,"Originals return sheet count warning  2 (ERROR 1)",null,null,"Scanner ",null,"O","O",null,null,"Originals return sheet count warning  2 (ERROR 1)"]
[1,7,7,"FNC-001-7007",126,"スキャナ編",null,"○","○",null,null,"原稿忘れ警告(原稿取り忘れ2)",null,null,null,null,"","","","","",1,7,7,"FNC-001-7007",126,"Scanner ",null,"O","O",null,null,"Originals left warning (Originals left on ADF 2)",null,null,"Scanner ",null,"O","O",null,null,"Originals left warning (Originals left on ADF 2)"]
[1,7,8,"FNC-001-7008",127,"スキャナ編",null,"○","○",null,null,"ADFジャム検出",null,null,null,null,"","","","","",1,7,8,"FNC-001-7008",127,"Scanner ",null,"O","O",null,null,"Paper jam detected in ADF",null,null,"Scanner ",null,"O","O",null,null,"Paper jam detected in ADF"]
[1,7,9,"FNC-001-7009",128,"スキャナ編",null,"○","○",null,null,"ADFセット不良",null,null,null,null,"","","","","",1,7,9,"FNC-001-7009",128,"Scanner ",null,"O","O",null,null,"Improper setting on ADF",null,null,"Scanner ",null,"O","O",null,null,"Improper setting on ADF"]
[1,7,10,"FNC-001-7010",129,"スキャナ編",null,"○","○",null,null,"メモリオーバーフロー",null,null,null,null,"","","","","",1,7,10,"FNC-001-7010",129,"Scanner ",null,"O","O",null,null,"Memory overflow",null,null,"Scanner ",null,"O","O",null,null,"Memory overflow"]
[1,7,11,"FNC-001-7011",130,"スキャナ編",null,"○","○",null,null,"スキャナモード時宛先未入力",null,null,null,null,"","","","","",1,7,11,"FNC-001-7011",130,"Scanner ",null,"O","O",null,null,"Destination not entered while scanner mode",null,null,"Scanner ",null,"O","O",null,null,"Destination not entered while scanner mode"]
[1,7,12,"FNC-001-7012",131,"スキャナ編",null,"○","○",null,null,"スキャナモード時コントローラエラー",null,null,null,null,"","","","","",1,7,12,"FNC-001-7012",131,"Scanner ",null,"O","O",null,null,"Controller error while scanner mode",null,null,"Scanner ",null,"O","O",null,null,"Controller error while scanner mode"]
[1,7,13,"FNC-001-7013",132,"スキャナ編",null,"○","○",null,null,"スキャナモード移行不可警告",null,null,null,null,"","","","","",1,7,13,"FNC-001-7013",132,"Scanner ",null,"O","O",null,null,"Warning of a prohibition of a shift to scanner mode",null,null,"Scanner ",null,"O","O",null,null,"Warning of a prohibition of a shift to scanner mode"]
[1,7,14,"FNC-001-7014",133,"スキャナ編",null,"○","○",null,null,"トラブル発生",null,null,null,null,"","","","","",1,7,14,"FNC-001-7014",133,"Scanner ",null,"O","O",null,null,"Occurrence of trouble",null,null,"Scanner ",null,"O","O",null,null,"Occurrence of trouble"]
[1,7,15,"FNC-001-7015",134,"スキャナ編",null,"○","○",null,null,"本体起動スキャン/PC起動スキャンでは表示しない警告",null,null,null,null,"","","","","",1,7,15,"FNC-001-7015",134,"Scanner ",null,"O","O",null,null,"Warning which is not displayed for the main unit start-up or PC start-up scan  ",null,null,"Scanner ",null,"O","O",null,null,"Warning which is not displayed for the main unit start-up or PC start-up scan  "]
[1,7,16,"FNC-001-7016",135,"スキャナ編",null,"○","○",null,null,"JOBシーケンスのソフトウエア異常(共通)",null,null,null,null,"","","","","",1,7,16,"FNC-001-7016",135,"Scanner ",null,"O","O",null,null,"JOB sequence software trouble (common) ",null,null,"Scanner ",null,"O","O",null,null,"JOB sequence software trouble (common) "]
[1,7,17,"FNC-001-7017",136,"スキャナ編",null,"○","○",null,null,"ネットワーク接続エラー1",null,null,null,null,"","","","","",1,7,17,"FNC-001-7017",136,"Scanner ",null,"O","O",null,null,"Network connection error  1",null,null,"Scanner ",null,"O","O",null,null,"Network connection error  1"]
[1,7,18,"FNC-001-7018",137,"スキャナ編",null,"○","○",null,null,"ネットワーク接続エラー2",null,null,null,null,"","","","","",1,7,18,"FNC-001-7018",137,"Scanner ",null,"O","O",null,null,"Network connection error   2",null,null,"Scanner ",null,"O","O",null,null,"Network connection error   2"]
[1,7,19,"FNC-001-7019",138,"スキャナ編",null,"○","○",null,null,"プロトコルエラー\n(Scan To E-mail)",null,null,null,null,"","","","","",1,7,19,"FNC-001-7019",138,"Scanner ",null,"O","O",null,null,"Protocol error  (Scan To E-mail)",null,null,"Scanner ",null,"O","O",null,null,"Protocol error  (Scan To E-mail)"]
[1,7,20,"FNC-001-7020",139,"スキャナ編",null,"○","○",null,null,"ネットワークケーブル未装着",null,null,null,null,"","","","","",1,7,20,"FNC-001-7020",139,"Scanner ",null,"O","O",null,null,"Network cable not connected",null,null,"Scanner ",null,"O","O",null,null,"Network cable not connected"]
[1,7,21,"FNC-001-7021",140,"スキャナ編",null,"○","○",null,null,"接続タイムアウト(共通)",null,null,null,null,"","","","","",1,7,21,"FNC-001-7021",140,"Scanner ",null,"O","O",null,null,"Connection timeout  (common)",null,null,"Scanner ",null,"O","O",null,null,"Connection timeout  (common)"]
[1,7,22,"FNC-001-7022",141,"スキャナ編",null,"○","○",null,null,"サーバー認証エラー1",null,null,null,null,"","","","","",1,7,22,"FNC-001-7022",141,"Scanner ",null,"O","O",null,null,"Server authentication error 1 ",null,null,"Scanner ",null,"O","O",null,null,"Server authentication error 1 "]
[1,7,23,"FNC-001-7023",142,"スキャナ編",null,"○","○",null,null,"サーバー認証エラー2",null,null,null,null,"","","","","",1,7,23,"FNC-001-7023",142,"Scanner ",null,"O","O",null,null,"Server authentication error 2",null,null,"Scanner ",null,"O","O",null,null,"Server authentication error 2"]
[1,7,24,"FNC-001-7024",143,"スキャナ編",null,"○","○",null,null,"指定されたフォルダが無い1",null,null,null,null,"","","","","",1,7,24,"FNC-001-7024",143,"Scanner ",null,"O","O",null,null,"Specified holder is missing 1",null,null,"Scanner ",null,"O","O",null,null,"Specified holder is missing 1"]
[1,7,25,"FNC-001-7025",144,"スキャナ編",null,"○","○",null,null,"指定されたフォルダが無い2",null,null,null,null,"","","","","",1,7,25,"FNC-001-7025",144,"Scanner ",null,"O","O",null,null,"Specified holder is missing 2 ",null,null,"Scanner ",null,"O","O",null,null,"Specified holder is missing 2 "]
[1,7,26,"FNC-001-7026",145,"スキャナ編",null,"○","○",null,null,"ユーザキャンセル(共通)",null,null,null,null,"","","","","",1,7,26,"FNC-001-7026",145,"Scanner ",null,"O","O",null,null,"Cancel by a user (common) ",null,null,"Scanner ",null,"O","O",null,null,"Cancel by a user (common) "]
[1,7,27,"FNC-001-7027",146,"スキャナ編",null,"○","○",null,null,"転送エラー",null,null,null,null,"","","","","",1,7,27,"FNC-001-7027",146,"Scanner ",null,"O","O",null,null,"Transfer error",null,null,"Scanner ",null,"O","O",null,null,"Transfer error"]
[1,7,28,"FNC-001-7028",147,"スキャナ編",null,"○","○",null,null,"メールの添付ファイルサイズが大きすぎる(Scan to E-mail)",null,null,null,null,"","","","","",1,7,28,"FNC-001-7028",147,"Scanner ",null,"O","O",null,null,"Oversized file attached to E-mail  (Scan to E-mail)",null,null,"Scanner ",null,"O","O",null,null,"Oversized file attached to E-mail  (Scan to E-mail)"]
[1,7,29,"FNC-001-7029",148,"スキャナ編",null,"○","○",null,null,"HDD容量オーバー",1,null,null,1,"0001",0,0,0,1,1,7,29,"FNC-001-7029",148,"Scanner ",null,"O","O",null,null,"Exceeding HDD capacity ",null,null,"Scanner ",null,"O","O",null,null,"Exceeding HDD capacity "]
[1,7,30,"FNC-001-7030",149,"スキャナ編",null,null,null,null,null,"Fromアドレスエラー",null,null,null,null,"","","","","",1,7,30,"FNC-001-7030",149,"Scanner ",null,null,null,null,null,"From Address error ",null,null,"Scanner ",null,null,null,null,null,"From Address error "]
[1,7,31,"FNC-001-7031",150,"スキャナ編",null,null,null,null,null,"S/MIME汎用エラー",null,null,null,null,"","","","","",1,7,31,"FNC-001-7031",150,"Scanner ",null,null,null,null,null,"Error for general purpose S/MIME ",null,null,"Scanner ",null,null,null,null,null,"Error for general purpose S/MIME "]
[1,7,32,"FNC-001-7032",151,"スキャナ編",null,null,null,null,null,"リダイレクト",null,null,null,null,"","","","","",1,7,32,"FNC-001-7032",151,"Scanner ",null,null,null,null,null,"Redirect",null,null,"Scanner ",null,null,null,null,null,"Redirect"]
[1,7,32,0,null,"スキャナ編",null,"○","○",null,"§１．９．1　スキャナジョブ履歴",null,null,null,null,null,"","","","","",1,7,32,0,null,"Scanner ",null,"O","O",null,"§１．９．1　スキャナジョブ履歴",null,null,null,"Scanner ",null,"O","O",null,"1.9.1    History of scanner job "]
[1,7,33,"FNC-001-7033",152,"スキャナ編",null,"○","○",null,null,"Active Job",null,null,null,null,"","","","","",1,7,33,"FNC-001-7033",152,"Scanner ",null,"O","O",null,null,"Active Job",null,null,"Scanner ",null,"O","O",null,null,"Active Job"]
[1,7,34,"FNC-001-7034",153,"スキャナ編",null,"○","○",null,null,"Done Job",null,null,null,null,"","","","","",1,7,34,"FNC-001-7034",153,"Scanner ",null,"O","O",null,null,"Done Job",null,null,"Scanner ",null,"O","O",null,null,"Done Job"]
[1,7,35,"FNC-001-7035",154,"スキャナ編",null,"○","○",null,null,"E-mailエラー通知",null,null,null,null,"","","","","",1,7,35,"FNC-001-7035",154,"Scanner ",null,"O","O",null,null,"Notification of E-mail error ",null,null,"Scanner ",null,"O","O",null,null,"Notification of E-mail error "]
[1,7,35,0,null,"スキャナ編",null,"○","○",null,"§１．９．２　スキャナジョブ情報",null,null,null,null,null,"","","","","",1,7,35,0,null,"Scanner ",null,"O","O",null,"§１．９．２　スキャナジョブ情報",null,null,null,"Scanner ",null,"O","O",null,"1.9.2.   Scanner job information "]
[1,7,36,"FNC-001-7036",155,"スキャナ編",null,"○","○",null,null,"ユーザージョブ番号",null,null,null,null,"","","","","",1,7,36,"FNC-001-7036",155,"Scanner ",null,"O","O",null,null,"User job number",null,null,"Scanner ",null,"O","O",null,null,"User job number"]
[1,7,37,"FNC-001-7037",156,"スキャナ編",null,"○","○",null,null,"ジョブ状態",null,null,null,null,"","","","","",1,7,37,"FNC-001-7037",156,"Scanner ",null,"O","O",null,null,"Job state",null,null,"Scanner ",null,"O","O",null,null,"Job state"]
[1,7,38,"FNC-001-7038",157,"スキャナ編",null,"○","○",null,null,"ユーザ名（登録元)",null,null,null,null,"","","","","",1,7,38,"FNC-001-7038",157,"Scanner ",null,"O","O",null,null,"User name  (Origin of registration) ",null,null,"Scanner ",null,"O","O",null,null,"User name  (Origin of registration) "]
[1,7,39,"FNC-001-7039",158,"スキャナ編",null,"○","○",null,null,"モード",null,null,null,null,"","","","","",1,7,39,"FNC-001-7039",158,"Scanner ",null,"O","O",null,null,"Mode",null,null,"Scanner ",null,"O","O",null,null,"Mode"]
[1,7,40,"FNC-001-7040",159,"スキャナ編",null,"○","○",null,null,"相手先(通信先)",null,null,null,null,"","","","","",1,7,40,"FNC-001-7040",159,"Scanner ",null,"O","O",null,null,"Destination (transmission destination)",null,null,"Scanner ",null,"O","O",null,null,"Destination (transmission destination)"]
[1,7,41,"FNC-001-7041",160,"スキャナ編",null,"○","○",null,null,"エラー内容",null,null,null,null,"","","","","",1,7,41,"FNC-001-7041",160,"Scanner ",null,"O","O",null,null,"Description of error ",null,null,"Scanner ",null,"O","O",null,null,"Description of error "]
[1,7,42,"FNC-001-7042",161,"スキャナ編",null,"○","○",null,null,"登録時刻",null,null,null,null,"","","","","",1,7,42,"FNC-001-7042",161,"Scanner ",null,"O","O",null,null,"Registered time ",null,null,"Scanner ",null,"O","O",null,null,"Registered time "]
[1,7,43,"FNC-001-7043",162,"スキャナ編",null,"○","○",null,null,"終了結果時刻",null,null,null,null,"","","","","",1,7,43,"FNC-001-7043",162,"Scanner ",null,"O","O",null,null,"Completion time ",null,null,"Scanner ",null,"O","O",null,null,"Completion time "]
[1,7,44,"FNC-001-7044",163,"スキャナ編",null,"○","○",null,null,"配信方法",null,null,null,null,"","","","","",1,7,44,"FNC-001-7044",163,"Scanner ",null,"O","O",null,null,"Transmission method",null,null,"Scanner ",null,"O","O",null,null,"Transmission method"]
[1,7,45,"FNC-001-7045",164,"スキャナ編",null,"○","○",null,null,"原稿枚数",null,null,null,null,"","","","","",1,7,45,"FNC-001-7045",164,"Scanner ",null,"O","O",null,null,"Number of document",null,null,"Scanner ",null,"O","O",null,null,"Number of document"]
[1,7,46,"FNC-001-7046",165,"スキャナ編",null,"○","○",null,null,"ファイル名",null,null,null,null,"","","","","",1,7,46,"FNC-001-7046",165,"Scanner ",null,"O","O",null,null,"File name ",null,null,"Scanner ",null,"O","O",null,null,"File name "]
[1,7,47,"FNC-001-7047",166,"スキャナ編",null,"○","○",null,null,"部数表示",null,null,null,null,"","","","","",1,7,47,"FNC-001-7047",166,"Scanner ",null,"O","O",null,null,"Display of the number of copy ",null,null,"Scanner ",null,"O","O",null,null,"Display of the number of copy "]
[1,7,48,"FNC-001-7048",167,"スキャナ編",null,"○","○",null,null,"終了予定時刻",null,null,null,null,"","","","","",1,7,48,"FNC-001-7048",167,"Scanner ",null,"O","O",null,null,"Estimated completion time ",null,null,"Scanner ",null,"O","O",null,null,"Estimated completion time "]
[1,7,49,"FNC-001-7049",168,"スキャナ編",null,"○","○",null,null,"受達確認",null,null,null,null,{"$f":"IF(P196=\"\",\"\",DEC2BIN(P196,4))","v":""},{"$f":"IF($Q196=\"\",\"\",VALUE(MID($Q196,1,1)))","v":""},{"$f":"IF($Q196=\"\",\"\",VALUE(MID($Q196,2,1)))","v":""},{"$f":"IF($Q196=\"\",\"\",VALUE(MID($Q196,3,1)))","v":""},{"$f":"IF($Q196=\"\",\"\",VALUE(MID($Q196,4,1)))","v":""},1,7,49,"FNC-001-7049",168,"Scanner ",null,"O","O",null,null,"Check for reception ",null,null,"Scanner ",null,"O","O",null,null,"Check for reception "]
[1,7,50,"FNC-001-7050",169,"スキャナ編",null,"○","○",null,null,"トランザクション番号",null,null,null,null,"","","","","",1,7,50,"FNC-001-7050",169,"Scanner ",null,"O","O",null,null,"Transaction number ",null,null,"Scanner ",null,"O","O",null,null,"Transaction number "]
[1,7,51,"FNC-001-7051",170,"スキャナ編",null,"○","○",null,null,"実行結果",null,null,null,null,"","","","","",1,7,51,"FNC-001-7051",170,"Scanner ",null,"O","O",null,null,"Execution result",null,null,"Scanner ",null,"O","O",null,null,"Execution result"]
[2,0,0,0,null,"スキャナ編",null,"○","○",null,"§２．　FieryScan関連",null,null,null,null,1,"0001",0,0,0,1,2,0,0,0,null,null,null,null,null,null,"§２．　FieryScan関連"]
[{"$f":"IF(K200<>\"\",IF(MID(K200,FIND(\"．\",K200,1)+1,1)=\"　\",A199+1,A199),A199)","v":2},{"$f":"IF($K200<>\"\",IF(A199<>A200,0,IF(MID($K200,FIND(\"．\",$K200,1)+1,1)<>\"　\",IF(MID($K200,FIND(\"．\",$K200,FIND(\"．\",$K200,1)+1)+1,1)=\"　\",B199+1,B199),B199)),B199)","v":0},{"$f":"IF(K200<>\"\",IF(AND(A199=A200,B199=B200),C199,0),C199+1)","v":1},{"$f":"IF(K200<>\"\",0,CONCATENATE(IF(A200>9,\"FNC-0\",\"FNC-00\"),TEXT(A200,\"0\"),\"-\",TEXT(B200,\"0\"),IF(C200>9,\"0\",\"00\"),TEXT(C200,\"0\")))","v":"FNC-002-0001"},{"$f":"IF(E199<>\"\",E199+1,IF(E198<>\"\",E198+1,IF(E197<>\"\",E197+1,E196+1)))","v":171},null,null,null,null,null,null,"Fiery Twain Scan",null,null,null,1,"0001",0,0,0,1,{"$f":"IF(AF200<>\"\",IF(MID(AF200,FIND(\"．\",AF200,1)+1,1)=\"　\",V199+1,V199),V199)","v":2},{"$f":"IF($K200<>\"\",IF(V199<>V200,0,IF(MID($K200,FIND(\"．\",$K200,1)+1,1)<>\"　\",IF(MID($K200,FIND(\"．\",$K200,FIND(\"．\",$K200,1)+1)+1,1)=\"　\",W199+1,W199),W199)),W199)","v":0},{"$f":"IF(AF200<>\"\",IF(AND(V199=V200,W199=W200),X199,0),X199+1)","v":1},{"$f":"IF(AF200<>\"\",0,CONCATENATE(IF(V200>9,\"FNC-0\",\"FNC-00\"),TEXT(V200,\"0\"),\"-\",TEXT(W200,\"0\"),IF(X200>9,\"0\",\"00\"),TEXT(X200,\"0\")))","v":"FNC-002-0001"},{"$f":"IF(Z199<>\"\",Z199+1,IF(Z198<>\"\",Z198+1,IF(Z197<>\"\",Z197+1,Z196+1)))","v":171}]
[{"$f":"IF(K201<>\"\",IF(MID(K201,FIND(\"．\",K201,1)+1,1)=\"　\",A200+1,A200),A200)","v":2},{"$f":"IF($K201<>\"\",IF(A200<>A201,0,IF(MID($K201,FIND(\"．\",$K201,1)+1,1)<>\"　\",IF(MID($K201,FIND(\"．\",$K201,FIND(\"．\",$K201,1)+1)+1,1)=\"　\",B200+1,B200),B200)),B200)","v":0},{"$f":"IF(K201<>\"\",IF(AND(A200=A201,B200=B201),C200,0),C200+1)","v":2},{"$f":"IF(K201<>\"\",0,CONCATENATE(IF(A201>9,\"FNC-0\",\"FNC-00\"),TEXT(A201,\"0\"),\"-\",TEXT(B201,\"0\"),IF(C201>9,\"0\",\"00\"),TEXT(C201,\"0\")))","v":"FNC-002-0002"},{"$f":"IF(E200<>\"\",E200+1,IF(E199<>\"\",E199+1,IF(E198<>\"\",E198+1,E197+1)))","v":172},null,null,null,null,null,null,"Fieryスキャン受付条件",null,null,null,1,"0001",0,0,0,1,{"$f":"IF(AF201<>\"\",IF(MID(AF201,FIND(\"．\",AF201,1)+1,1)=\"　\",V200+1,V200),V200)","v":2},{"$f":"IF($K201<>\"\",IF(V200<>V201,0,IF(MID($K201,FIND(\"．\",$K201,1)+1,1)<>\"　\",IF(MID($K201,FIND(\"．\",$K201,FIND(\"．\",$K201,1)+1)+1,1)=\"　\",W200+1,W200),W200)),W200)","v":0},{"$f":"IF(AF201<>\"\",IF(AND(V200=V201,W200=W201),X200,0),X200+1)","v":2},{"$f":"IF(AF201<>\"\",0,CONCATENATE(IF(V201>9,\"FNC-0\",\"FNC-00\"),TEXT(V201,\"0\"),\"-\",TEXT(W201,\"0\"),IF(X201>9,\"0\",\"00\"),TEXT(X201,\"0\")))","v":"FNC-002-0002"},{"$f":"IF(Z200<>\"\",Z200+1,IF(Z199<>\"\",Z199+1,IF(Z198<>\"\",Z198+1,Z197+1)))","v":172}]
[{"$f":"IF(K202<>\"\",IF(MID(K202,FIND(\"．\",K202,1)+1,1)=\"　\",A201+1,A201),A201)","v":2},{"$f":"IF($K202<>\"\",IF(A201<>A202,0,IF(MID($K202,FIND(\"．\",$K202,1)+1,1)<>\"　\",IF(MID($K202,FIND(\"．\",$K202,FIND(\"．\",$K202,1)+1)+1,1)=\"　\",B201+1,B201),B201)),B201)","v":0},{"$f":"IF(K202<>\"\",IF(AND(A201=A202,B201=B202),C201,0),C201+1)","v":3},{"$f":"IF(K202<>\"\",0,CONCATENATE(IF(A202>9,\"FNC-0\",\"FNC-00\"),TEXT(A202,\"0\"),\"-\",TEXT(B202,\"0\"),IF(C202>9,\"0\",\"00\"),TEXT(C202,\"0\")))","v":"FNC-002-0003"},{"$f":"IF(E201<>\"\",E201+1,IF(E200<>\"\",E200+1,IF(E199<>\"\",E199+1,E198+1)))","v":173},null,null,null,null,null,null,"Fieryスキャンで発生する警告一覧",null,null,null,1,"0001",0,0,0,1,{"$f":"IF(AF202<>\"\",IF(MID(AF202,FIND(\"．\",AF202,1)+1,1)=\"　\",V201+1,V201),V201)","v":2},{"$f":"IF($K202<>\"\",IF(V201<>V202,0,IF(MID($K202,FIND(\"．\",$K202,1)+1,1)<>\"　\",IF(MID($K202,FIND(\"．\",$K202,FIND(\"．\",$K202,1)+1)+1,1)=\"　\",W201+1,W201),W201)),W201)","v":0},{"$f":"IF(AF202<>\"\",IF(AND(V201=V202,W201=W202),X201,0),X201+1)","v":3},{"$f":"IF(AF202<>\"\",0,CONCATENATE(IF(V202>9,\"FNC-0\",\"FNC-00\"),TEXT(V202,\"0\"),\"-\",TEXT(W202,\"0\"),IF(X202>9,\"0\",\"00\"),TEXT(X202,\"0\")))","v":"FNC-002-0003"},{"$f":"IF(Z201<>\"\",Z201+1,IF(Z200<>\"\",Z200+1,IF(Z199<>\"\",Z199+1,Z198+1)))","v":173}]
[null,null,null,null,null,null,null,null,null,null,null,null,null,null,"e","e","e","e","e","e","e"]
[]
[]
[null,null,null,null,null,null,null,null,null,null,null,null,null,null,null,null,{"$f":"SUM(U2:U202)","v":10}]
[]
[]
[]
[]
[]
[]
[]
[]
[]
[]
[]
[]
[]
[]
[]
[]
[]
[]
[]
[]
[]
[]
[]
[]
[]
[]
[]
[]
[]
[]
[]
[]
[]
[]
[]
[]
[]
[]
[]
[]
[]
[]
[]
[]
[]
[]
[]
[]
[]
[]
[]
[]
[]
[]
[]
[]
[]
[]
[]
[]
[]
[]
[]
[]
[]
[]
[]
[]
[]
[]
[]
[]
[]
[]
[]
[]
[]
[]
[]
[]
[]
[]
[]
[]
[]
[]
[]
[]
[]
[]
[]
[]
[]
[]
[]
[]
[]
[]
[]
[]
[]
[]
[]
[]
[]
[]
[]
[]
[]
[]
[]
[]
[]
[]
[]
[]
[]
[]
[]
[]
[]
[]
[]
[]
[]
[]
[]
[]
[]
[]
[]
[]
[]
[]
[]
[]
[]
[]
[]
[]
[]
[]
[]
[]
[]
[]
[]
[]
[]
[]
[]
[]
[]
[]
[]
[]
[]
[]
[]
[]
[]
[]
[]
[]
[]
[]
[]
[]
[]
[]
[]
[]
[]
[]
[]
[]
[]
[]
[]
[]
[]
[]
[]
[]
[]
[]
[]
[]
[]
[]
[]
[]
[]
[]
[]
[]
[]
[]
[]
[]
[]
[]
[]
[]
[]
[]
[]
[]
[]
[]
[]
[]
[]
[]
[]
[]
[]
[]
[]
[]
[]
[]
[]
[]
[]
[]
[]
[]
[]
[]
[]
[]
[]
[]
[]
[]
[]
[]
[]
[]
[]
[]
[]
[]
[]
[]
[]
[]
[]
[]
[]
[]
[]
[]
[]
[]
[]
[]
[]
[]
[]
[]
[]
[]
[]
[]
[]
[]
[]
[]
[]
[]
[]
[]
[]
[]
[]
[]
[]
[]
[]
[]
[]
[]
[]
[]
[]
[]
[]
[]
[]
[]
[]
[]
[]
[]
[]
[]
[]
[]
[]
[]
[]
[]
[]
[]
[]
[]
[]
[]
[]
[]
[]
[]
[]
[]
[]
[]
[]
[]
[]
[]
[]
[]
[]
[]
[]
[]
[]
[]
[]
[]
[]
[]
[]
[]
[]
[]
[]
[]
[]
[]
[]
[]
[]
[]
[]
[]
[]
[]
[]
[]
[]
[]
[]
[]
[]
[]
[]
[]
[]
[]
[]
[]
[]
[]
[]
[]
[]
[]
[]
[]
[]
[]
[]
[]
[]
[]
[]
[]
[]
[]
[]
[]
[]
[]
[]
[]
[]
[]
[]
[]
[]
[]
[]
[]
[]
[]
[]
[]
[]
[]
[]
[]
[]
[]
[]
[]
[]
[]
[]
[]
[]
[]
[]
[]
[]
[]
[]
[]
[]
[]
[]
[]
[]
[]
[]
[]
[]
[]
[]
[]
[]
[]
[]
[]
[]
[]
[]
[]
[]
[]
[]
[]
[]
[]
[]
[]
[]
[]
[]
[]
[]
[]
[]
[]
[]
[]
[]
[]
[]
[]
[]
[]
[]
[]
[]
[]
[]
[]
[]
[]
[]
[]
[]
[]
[]
[]
[]
[]
[]
[]
[]
[]
[]
[]
[]
[]
[]
[]
[]
[]
[]
[]
[]
[]
[]
[]
[]
[]
[]
[]
[]
[]
[]
[]
[]
[]
[]
[]
[]
[]
[]
[]
[]
[]
[]
[]
[]
[]
[]
[]
[]
[]
[]
[]
[]
[]
[]
[]
[]
[]
[]
[]
[]
[]
[]
[]
[]
[]
[]
[]
[]
[]
[]
[]
[]
[]
[]
[]
[]
[]
[]
[]
[]
[]
[]
[]
[]
[]
[]
[]
[]
[]
[]
[]
[]
[]
[]
[]
[]
[]
[]
[]
[]
[]
[]
[]
[]
[]
[]
[]
[]
[]
[]
[]
[]
[]
[]
[]
[]
[]
[]
[]
[]
[]
[]
[]
[]
[]
[]
[]
[]
[]
[]
[]
[]
[]
[]
[]
[]
[]
[]
[]
[]
[]
[]
[]
[]
[]
[]
[]
[]
[]
[]
[]
[]
[]
[]
[]
[]
[]
[]
[]
[]
[]
[]
[]
[]
[]
[]
[]
[]
[]
[]
[]
[]
[]
[]
[]
[]
[]
[]
[]
[]
[]
[]
[]
[]
[]
[]
[]
[]
[]
[]
[]
[]
[]
[]
[]
[]
[]
[]
[]
[]
[]
[]
[]
[]
[]
[]
[]
[]
[]
[]
[]
[]
[]
[]
[]
[]
[]
[]
[]
[]
[]
[]
[]
[]
[]
[]
[]
[]
[]
[]
[]
[]
[]
[]
[]
[]
[]
[]
[]
[]
[]
[]
[]
[]
[]
[]
[]
[]
[]
[]
[]
[]
[]
[]
[]
[]
[]
[]
[]
[]
[]
[]
[]
[]
[]
[]
[]
[]
[]
[]
[]
[]
[]
[]
[]
[]
[]
[]
[]
[]
[]
[]
[]
[]
[]
[]
[]
[]
[]
[]
[]
[]
[]
[]
[]
[]
[]
[]
[]
[]
[]
[]
[]
[]
[]
[]
[]
[]
[]
[]
[]
[]
[]
[]
[]
[]
[]
[]
[]
[null,null,null,null,null,null,null,null,null,null,null,null,null,null,1]
[null,null,null,null,null,null,null,null,null,null,null,null,null,null,1]
[null,null,null,null,null,null,null,null,null,null,null,null,null,null,1]
[null,null,null,null,null,null,null,null,null,null,null,null,null,null,1]
[null,null,null,null,null,null,null,null,null,null,null,null,null,null,0]
[null,null,null,null,null,null,null,null,null,null,null,null,null,null,0]
[null,null,null,null,null,null,null,null,null,null,null,null,null,null,0]
[null,null,null,null,null,null,null,null,null,null,null,null,null,null,0]
[null,null,null,null,null,null,null,null,null,null,null,null,null,null,0]
[null,null,null,null,null,null,null,null,null,null,null,null,null,null,0]
[null,null,null,null,null,null,null,null,null,null,null,null,null,null,0]
[null,null,null,null,null,null,null,null,null,null,null,null,null,null,0]
[null,null,null,null,null,null,null,null,null,null,null,null,null,null,0]
[null,null,null,null,null,null,null,null,null,null,null,null,null,null,0]

{"sheet":"搭載機能仕様書(スキャナ編)","index":1,"n_rows":124,"n_cols":676,"rows_kept":124,"cut":false,"hidden":false,"merged":[]}
["Ref.No.","見出し","機能名称","統合仕様","Donau1(基本)","Donau1(機能拡張1)","Donau1(機能拡張2)","Donau2(基本)","Donau2(機能拡張1)","Donau2(機能拡張2)","Donau3(機能拡張1)","Donau3(機能拡張2)","Amur1(基本)","Amur1(機能拡張1)","Amur2(基本)","Amur2(機能拡張1)","Amur3(基本)","Amur3(機能拡張1)","Taiga（基本）","DonauBK（基本）","Minerva0(基本)","Minerva1(基本)","Minerva0(MR1)","Minerva1(MR1)","ZeusX(基本)","Zeus0(基本)","Zeus1(基本)","Zeus2(基本)","Zeus3(基本)","Minerva0BK(基本)","Minerva1BK(基本)","Minerva0（機能拡張1）","Minerva1（機能拡張1）","ZeusX（機能拡張1）","Zeus0（機能拡張1）","Zeus1（機能拡張1）","Zeus2（機能拡張1）","Zeus3（機能拡張1）","ZeusMLK X（基本）","ZeusMLK 0（基本）","ZeusMLK 1（基本）","ZeusMLK 2（基本）","ZeusMLK 3（基本）","Minerva0（機能拡張2）","Minerva1（機能拡張2）","ZeusMLK X(機能拡張1)","ZeusMLK 0(機能拡張1)","ZeusMLK 1(機能拡張1)","ZeusMLK 2(機能拡張1)","ZeusMLK 3(機能拡張1)","Minerva0BK（機能拡張1）","Minerva1BK（機能拡張1）","ZeusBK X（基本）","ZeusBK 0（基本）","ZeusBK 1（基本）","ZeusBK 2（基本）","ZeusBK 3（基本）","Minerva0（機能拡張3）","Minerva1（機能拡張3）","ZeusMLK X(機能拡張2)","ZeusMLK 0(機能拡張2)","ZeusMLK 1(機能拡張2)","ZeusMLK 2(機能拡張2)","ZeusMLK 3(機能拡張2)","Minerva0BK（機能拡張2）","Minerva1BK（機能拡張2）","ZeusBK X(機能拡張1)","ZeusBK 0(機能拡張1)","ZeusBK 1(機能拡張1)","ZeusBK 2(機能拡張1)","ZeusBK 3(機能拡張1)","Minerva0（機能拡張4）","Minerva1（機能拡張4）","ZeusMLK X(機能拡張3)","ZeusMLK 0(機能拡張3)","ZeusMLK 1(機能拡張3)","ZeusMLK 2(機能拡張3)","ZeusMLK 3(機能拡張3)","Minerva0BK（機能拡張3）","Minerva1BK（機能拡張3）","ZeusBK X(機能拡張2)","ZeusBK 0(機能拡張2)","ZeusBK 1(機能拡張2)","ZeusBK 2(機能拡張2)","ZeusBK 3(機能拡張2)","Minerva0（機能拡張5）","Minerva1（機能拡張5）","ZeusMLK X(機能拡張4)","ZeusMLK 0(機能拡張4)","ZeusMLK 1(機能拡張4)","ZeusMLK 2(機能拡張4)","ZeusMLK 3(機能拡張4)","Minerva0BK（機能拡張4）","Minerva1BK（機能拡張4）","ZeusBK X(機能拡張3)","ZeusBK 0(機能拡張3)","ZeusBK 1(機能拡張3)","ZeusBK 2(機能拡張3)","ZeusBK 3(機能拡張3)","Minerva0（機能拡張2）MIF",null,"Minerva1（機能拡張2）MIF",null,"ZeusMLK X(機能拡張1)MIF",null,"ZeusMLK 0(機能拡張1)MIF",null,"ZeusMLK 1(機能拡張1)MIF",null,"ZeusMLK 2(機能拡張1)MIF",null,"ZeusMLK 3(機能拡張1)MIF",null,"Minerva0BK（機能拡張1）MIF",null,"Minerva1BK（機能拡張1）MIF",null,"Minerva0（機能拡張3） MIF",null,"Minerva1（機能拡張3） MIF",null,"ZeusMLK X(機能拡張2) MIF",null,"ZeusMLK 0(機能拡張2) MIF",null,"ZeusMLK 1(機能拡張2) MIF",null,"ZeusMLK 2(機能拡張2) MIF",null,"ZeusMLK 3(機能拡張2) MIF",null,"Minerva0BK（機能拡張2） MIF",null,"Minerva1BK（機能拡張2） MIF",null,"Poseidon 1(IT5_1.0)","Poseidon 2 (IT5_1.0)","Poseidon 3 (IT5_1.0)","Poseidon 1 (IT5_2.0)","Poseidon 2 (IT5_2.0)","Poseidon 3 (IT5_2.0)","ZeusS 1(IT5_2.0)","ZeusS 2 (IT5_2.0)","ZeusS2.5 (IT5_2.0)","Poseidon 1 (IT5_2.1)","Poseidon 2 (IT5_2.1)","Poseidon 3 (IT5_2.1) ","ZeusS 1 (IT5_2.1)","ZeusS 2 (IT5_2.1)","ZeusS 2.5 (IT5_2.1)","Helios 2 (IT5_2.1)","Helios 3 (IT5_2.1)","Poseidon 1 (IT5_2.2)","Poseidon 2 (IT5_2.2)","Poseidon 3 (IT5_2.2) ","ZeusS 1 (IT5_2.2)","ZeusS 2 (IT5_2.2)","ZeusS 2.5 (IT5_2.2)","Helios 2 (IT5_2.2)","Helios 3 (IT5_2.2)","MinervaSBK X(IT5_2.2)","MinervaSBK 0(IT5_2.2)","Poseidon 1 (IT5_3.0)","Poseidon 2 (IT5_3.0)","Poseidon 3 (IT5_3.0) ","ZeusS 1 (IT5_3.0)","ZeusS 2 (IT5_3.0)","ZeusS 2.5 (IT5_3.0)","Helios 2 (IT5_3.0)","Helios 3 (IT5_3.0)","MinervaSBK X(IT5_3.0)","MinervaSBK 0(IT5_3.0)","ZeusS Z (IT5_3.0)","ZeusS X (IT5_3.0)","ZeusS 0 (IT5_3.0)","Icarus 2 (IT5_3.2)","Icarus 3 (IT5_3.2)","VenusMLK (IT5_3.2)","Poseidon 1 (IT5_3.2)","Poseidon 2 (IT5_3.2)","Poseidon 3 (IT5_3.2) ","ZeusS 1 (IT5_3.2)","ZeusS 2 (IT5_3.2)","ZeusS 2.5 (IT5_3.2)","Helios 2 (IT5_3.2)","Helios 3 (IT5_3.2)","MinervaSBK X(IT5_3.2)","MinervaSBK 0(IT5_3.2)","ZeusS Z (IT5_3.2)","ZeusS X (IT5_3.2)","ZeusS 0 (IT5_3.2)","ZeusSBK_1st X (IT5_3.2)","ZeusSBK_1st 0 (IT5_3.2)","ZeusSBK_1st 1 (IT5_3.2)","ZeusSBK_1st 2 (IT5_3.2)","Poseidon 1 (IT5_3.3)","Poseidon 2 (IT5_3.3)","Poseidon 3 (IT5_3.3) ","ZeusS 1 (IT5_3.3)","ZeusS 2 (IT5_3.3)","ZeusS 2.5 (IT5_3.3)","Helios 2 (IT5_3.3)","Helios 3 (IT5_3.3)","MinervaSBK X(IT5_3.3)","MinervaSBK 0(IT5_3.3)","ZeusS Z (IT5_3.3)","ZeusS X (IT5_3.3)","ZeusS 0 (IT5_3.3)","VenusMLK (IT5_3.3)","ZeusSBK_1st X (IT5_3.3)","ZeusSBK_1st 0 (IT5_3.3)","ZeusSBK_1st 1 (IT5_3.3)","ZeusSBK_1st 2 (IT5_3.3)","Poseidon 1 (IT5_3.4)","Poseidon 2 (IT5_3.4)","Poseidon 3 (IT5_3.4) ","ZeusS 1 (IT5_3.4)","ZeusS 2 (IT5_3.4)","ZeusS 2.5 (IT5_3.4)","Helios 2 (IT5_3.4)","Helios 3 (IT5_3.4)","MinervaSBK X(IT5_3.4)","MinervaSBK 0(IT5_3.4)","ZeusS Z (IT5_3.4)","ZeusS X (IT5_3.4)","ZeusS 0 (IT5_3.4)","VenusMLK (IT5_3.4)","ZeusSBK_1st X (IT5_3.4)","ZeusSBK_1st 0 (IT5_3.4)","ZeusSBK_1st 1 (IT5_3.4)","ZeusSBK_1st 2 (IT5_3.4)","Poseidon 1 (IT5_4.0)","Poseidon 2 (IT5_4.0)","Poseidon 3 (IT5_4.0) ","ZeusS 1 (IT5_4.0)","ZeusS 2 (IT5_4.0)","ZeusS 2.5 (IT5_4.0)","Helios 2 (IT5_4.0)","Helios 3 (IT5_4.0)","MinervaSBK X(IT5_4.0)","MinervaSBK 0(IT5_4.0)","ZeusS Z (IT5_4.0)","ZeusS X (IT5_4.0)","ZeusS 0 (IT5_4.0)","VenusMLK (IT5_4.0)","ZeusSBK_1st X (IT5_4.0)","ZeusSBK_1st 0 (IT5_4.0)","ZeusSBK_1st 1 (IT5_4.0)","ZeusSBK_1st 2 (IT5_4.0)","KronosS (IT5_4.0)","Poseidon 1 (IT5_4.1)","Poseidon 2 (IT5_4.1)","Poseidon 3 (IT5_4.1) ","ZeusS 1 (IT5_4.1)","ZeusS 2 (IT5_4.1)","ZeusS 2.5 (IT5_4.1)","Helios 2 (IT5_4.1)","Helios 3 (IT5_4.1)","MinervaSBK X(IT5_4.1)","MinervaSBK 0(IT5_4.1)","ZeusS Z (IT5_4.1)","ZeusS X (IT5_4.1)","ZeusS 0 (IT5_4.1)","VenusMLK (IT5_4.1)","ZeusSBK_1st X (IT5_4.1)","ZeusSBK_1st 0 (IT5_4.1)","ZeusSBK_1st 1 (IT5_4.1)","ZeusSBK_1st 2 (IT5_4.1)","MinervaMLK 0 (IT5_4.1)","MinervaMLK 1 (IT5_4.1)","ZeusSBK_2nd Z (IT5_4.1)","ZeusSBK_2nd X (IT5_4.1)","ZeusSBK_2nd 0 (IT5_4.1)","ZeusSBK_2nd 1 (IT5_4.1)","ZeusSBK_2nd 2 (IT5_4.1)","Poseidon 1 (IT5_4.2)","Poseidon 2 (IT5_4.2)","Poseidon 3 (IT5_4.2) ","ZeusS 1 (IT5_4.2)","ZeusS 2 (IT5_4.2)","ZeusS 2.5 (IT5_4.2)","Helios 2 (IT5_4.2)","Helios 3 (IT5_4.2)","MinervaSBK X(IT5_4.2)","MinervaSBK 0(IT5_4.2)","ZeusS Z (IT5_4.2)","ZeusS X (IT5_4.2)","ZeusS 0 (IT5_4.2)","VenusMLK (IT5_4.2)","ZeusSBK_1st X (IT5_4.2)","ZeusSBK_1st 0 (IT5_4.2)","ZeusSBK_1st 1 (IT5_4.2)","ZeusSBK_1st 2 (IT5_4.2)","KronosS (IT5_4.2)","MinervaMLK 0 (IT5_4.2)","MinervaMLK 1 (IT5_4.2)","ZeusSBK_2nd Z (IT5_4.2)","ZeusSBK_2nd X (IT5_4.2)","ZeusSBK_2nd 0 (IT5_4.2)","ZeusSBK_2nd 1 (IT5_4.2)","ZeusSBK_2nd 2 (IT5_4.2)","Eagle 1 (IT6_1.0)","Eagle 2 (IT6_1.0)","Eagle 2.5 (IT6_1.0)","Sparrow1MFP (IT6_1.0)","Sparrow2MFP (IT6_1.0)","Sparrow2AIO (IT6_1.0)","Sparrow1/2SFP (IT6_1.0)","DenebMLK 1 (IT6_1.0)","DenebMLK 2 (IT6_1.0)","DenebMLK 3 (IT6_1.0)","DenebMLK 4 (IT6_1.0)","Eagle 1 (IT6_2.0)","Eagle 2 (IT6_2.0)","Eagle 2.5 (IT6_2.0)","Sparrow1MFP (IT6_2.0)","Sparrow2MFP (IT6_2.0)","Sparrow2AIO (IT6_2.0)","Sparrow1/2SFP (IT6_2.0)","DenebMLK 1 (IT6_2.0)","DenebMLK 2 (IT6_2.0)","DenebMLK 3 (IT6_2.0)","DenebMLK 4 (IT6_2.0)","Eagle Z (IT6_2.0)","Eagle X (IT6_2.0)","Eagle 0 (IT6_2.0)","Eagle Z+ (IT6_2.0)","EagleBK Z (IT6_2.0)","EagleBK X (IT6_2.0)","EagleBK 0 (IT6_2.0)","EagleBK 1 (IT6_2.0)","EagleBK 2 (IT6_2.0)","EagleBK Z+ (IT6_2.0)","SparrowBK 0 MFP (IT6_2.0)","SparrowBK 1 MFP (IT6_2.0)","SparrowBK 0 SFP (IT6_2.0)","HeliosMLK 2 　中国 (IT6_2.0)","HeliosMLK 2.5 中国 (IT6_2.0) ","HeliosMLK 3   中国 (IT6_2.0) ","HeliosMLK 2.5 欧州 (IT6_2.0) ","HeliosMLK 2   その他/日本 (IT6_2.0) ","HeliosMLK 3   その他 (IT6_2.0) ","HeliosMLK 2.5 その他（FAX/FNS無し）(IT6_2.0) ","HeliosMLK 3   その他（FAX/FNS無し）(IT6_2.0) ","Eagle 1 (IT6_2.0MR2)","Eagle 2 (IT6_2.0MR2)","Eagle 2.5 (IT6_2.0MR2)","Sparrow1MFP (IT6_2.0MR2)","Sparrow2MFP (IT6_2.0MR2)","Sparrow2AIO (IT6_2.0MR2)","Sparrow1/2SFP (IT6_2.0MR2)","DenebMLK 1 (IT6_2.0MR2)","DenebMLK 2 (IT6_2.0MR2)","DenebMLK 3 (IT6_2.0MR2)","DenebMLK 4 (IT6_2.0MR2)","Eagle Z (IT6_2.0MR2)","Eagle X (IT6_2.0MR2)","Eagle 0 (IT6_2.0MR2)","Eagle 1 (IT6_2.0MR3)","Eagle 2 (IT6_2.0MR3)","Eagle 2.5 (IT6_2.0MR3)","Sparrow1MFP (IT6_2.0MR3)","Sparrow2MFP (IT6_2.0MR3)","Sparrow2AIO (IT6_2.0MR3)","Sparrow1/2SFP (IT6_2.0MR3)","DenebMLK 1 (IT6_2.0MR3)","DenebMLK 2 (IT6_2.0MR3)","DenebMLK 3 (IT6_2.0MR3)","DenebMLK 4 (IT6_2.0MR3)","Eagle Z (IT6_2.0MR3)","Eagle X (IT6_2.0MR3)","Eagle 0 (IT6_2.0MR3)","Eagle Z+ (IT6_2.0MR3)","EagleBK Z (IT6_2.0MR3)","EagleBK X (IT6_2.0MR3)","EagleBK 0 (IT6_2.0MR3)","EagleBK 1 (IT6_2.0MR3)","EagleBK 2 (IT6_2.0MR3)","EagleBK Z+ (IT6_2.0MR3)","SparrowBK 0 MFP (IT6_2.0MR3)","SparrowBK 1 MFP (IT6_2.0MR3)","SparrowBK 0 SFP (IT6_2.0MR3)","HeliosMLK 2 　中国 (IT6_2.0MR3)","HeliosMLK 2.5 中国 (IT6_2.0MR3) ","HeliosMLK 3   中国 (IT6_2.0MR3) ","HeliosMLK 2.5 欧州 (IT6_2.0MR3) ","HeliosMLK 2   その他/日本 (IT6_2.0MR3) ","HeliosMLK 3   その他 (IT6_2.0MR3) ","HeliosMLK 2.5 その他（FAX/FNS無し）(IT6_2.0MR3) ","HeliosMLK 3   その他（FAX/FNS無し）(IT6_2.0MR3) ","Eagle 1 (IT6_2.1)","Eagle 2 (IT6_2.1)","Eagle 2.5 (IT6_2.1)","Sparrow1MFP (IT6_2.1)","Sparrow2MFP (IT6_2.1)","Sparrow2AIO (IT6_2.1)","Sparrow1/2SFP (IT6_2.1)","DenebMLK 1 (IT6_2.1)","DenebMLK 2 (IT6_2.1)","DenebMLK 3 (IT6_2.1)","DenebMLK 4 (IT6_2.1)","Eagle Z (IT6_2.1)","Eagle X (IT6_2.1)","Eagle 0 (IT6_2.1)","Eagle Z+ (IT6_2.1)","EagleBK Z (IT6_2.1)","EagleBK X (IT6_2.1)","EagleBK 0 (IT6_2.1)","EagleBK 1 (IT6_2.1)","EagleBK 2 (IT6_2.1)","EagleBK Z+ (IT6_2.1)","SparrowBK 0 MFP (IT6_2.1)","SparrowBK 1 MFP (IT6_2.1)","SparrowBK 0 SFP (IT6_2.1)","HeliosMLK 2 　中国 (IT6_2.1)","HeliosMLK 2.5 中国 (IT6_2.1) ","HeliosMLK 3   中国 (IT6_2.1) ","HeliosMLK 2.5 欧州 (IT6_2.1) ","HeliosMLK 2   その他/日本 (IT6_2.1) ","HeliosMLK 3   その他 (IT6_2.1) ","HeliosMLK 2.5 その他（FAX/FNS無し）(IT6_2.1) ","HeliosMLK 3   その他（FAX/FNS無し）(IT6_2.1) ","Eagle 1 (IT6_2.2)","Eagle 2 (IT6_2.2)","Eagle 2.5 (IT6_2.2)","Sparrow1MFP (IT6_2.2)","Sparrow2MFP (IT6_2.2)","Sparrow2AIO (IT6_2.2)","Sparrow1/2SFP (IT6_2.2)","DenebMLK 1 (IT6_2.2)","DenebMLK 2 (IT6_2.2)","DenebMLK 3 (IT6_2.2)","DenebMLK 4 (IT6_2.2)","Eagle Z (IT6_2.2)","Eagle X (IT6_2.2)","Eagle 0 (IT6_2.2)","Eagle Z+ (IT6_2.2)","EagleBK Z (IT6_2.2)","EagleBK X (IT6_2.2)","EagleBK 0 (IT6_2.2)","EagleBK 1 (IT6_2.2)","EagleBK 2 (IT6_2.2)","EagleBK Z+ (IT6_2.2)","SparrowBK 0 MFP (IT6_2.2)","SparrowBK 1 MFP (IT6_2.2)","SparrowBK 0 SFP (IT6_2.2)","HeliosMLK 2 　中国 (IT6_2.2)","HeliosMLK 2.5 中国 (IT6_2.2) ","HeliosMLK 3   中国 (IT6_2.2) ","HeliosMLK 2.5 欧州 (IT6_2.2) ","HeliosMLK 2   その他/日本 (IT6_2.2) ","HeliosMLK 3   その他 (IT6_2.2) ","HeliosMLK 2.5 その他（FAX/FNS無し）(IT6_2.2) ","HeliosMLK 3   その他（FAX/FNS無し）(IT6_2.2) ","MinervaSSBK X（IT6_2.2）","MinervaSSBK 0（IT6_2.2）","Eagle 1 (IT6_2.2MR1)","Eagle 2 (IT6_2.2MR1)","Eagle 2.5 (IT6_2.2MR1)","Sparrow1MFP (IT6_2.2MR1)","Sparrow2MFP (IT6_2.2MR1)","Sparrow2AIO (IT6_2.2MR1)","Sparrow1/2SFP (IT6_2.2MR1)","DenebMLK 1 (IT6_2.2MR1)","DenebMLK 2 (IT6_2.2MR1)","DenebMLK 3 (IT6_2.2MR1)","DenebMLK 4 (IT6_2.2MR1)","Eagle Z (IT6_2.2MR1)","Eagle X (IT6_2.2MR1)","Eagle 0 (IT6_2.2MR1)","Eagle Z+ (IT6_2.2MR1)","EagleBK Z (IT6_2.2MR1)","EagleBK X (IT6_2.2MR1)","EagleBK 0 (IT6_2.2MR1)","EagleBK 1 (IT6_2.2MR1)","EagleBK 2 (IT6_2.2MR1)","EagleBK Z+ (IT6_2.2MR1)","SparrowBK 0 MFP (IT6_2.2MR1)","SparrowBK 1 MFP (IT6_2.2MR1)","SparrowBK 0 SFP (IT6_2.2MR1)","HeliosMLK 2 　中国 (IT6_2.2MR1)","HeliosMLK 2.5 中国 (IT6_2.2MR1) ","HeliosMLK 3   中国 (IT6_2.2MR1) ","HeliosMLK 2.5 欧州 (IT6_2.2MR1) ","HeliosMLK 2   その他/日本 (IT6_2.2MR1) ","HeliosMLK 3   その他 (IT6_2.2MR1) ","HeliosMLK 2.5 その他（FAX/FNS無し）(IT6_2.2MR1) ","HeliosMLK 3   その他（FAX/FNS無し）(IT6_2.2MR1) ","Eagle 1 (IT6_2.2MR2)","Eagle 2 (IT6_2.2MR2)","Eagle 2.5 (IT6_2.2MR2)","Sparrow1MFP (IT6_2.2MR2)","Sparrow2MFP (IT6_2.2MR2)","Sparrow2AIO (IT6_2.2MR2)","Sparrow1/2SFP (IT6_2.2MR2)","DenebMLK 1 (IT6_2.2MR2)","DenebMLK 2 (IT6_2.2MR2)","DenebMLK 3 (IT6_2.2MR2)","DenebMLK 4 (IT6_2.2MR2)","Eagle Z (IT6_2.2MR2)","Eagle X (IT6_2.2MR2)","Eagle 0 (IT6_2.2MR2)","Eagle Z+ (IT6_2.2MR2)","EagleBK Z (IT6_2.2MR2)","EagleBK X (IT6_2.2MR2)","EagleBK 0 (IT6_2.2MR2)","EagleBK 1 (IT6_2.2MR2)","EagleBK 2 (IT6_2.2MR2)","EagleBK Z+ (IT6_2.2MR2)","SparrowBK 0 MFP (IT6_2.2MR2)","SparrowBK 1 MFP (IT6_2.2MR2)","SparrowBK 0 SFP (IT6_2.2MR2)","HeliosMLK 2 　中国 (IT6_2.2MR2)","HeliosMLK 2.5 中国 (IT6_2.2MR2) ","HeliosMLK 3   中国 (IT6_2.2MR2) ","HeliosMLK 2.5 欧州 (IT6_2.2MR2) ","HeliosMLK 2   その他/日本 (IT6_2.2MR2) ","HeliosMLK 3   その他 (IT6_2.2MR2) ","HeliosMLK 2.5 その他（FAX/FNS無し）(IT6_2.2MR2) ","HeliosMLK 3   その他（FAX/FNS無し）(IT6_2.2MR2) ","MinervaSSBK X（IT6_2.2MR2）","MinervaSSBK 0（IT6_2.2MR2）","EagleⅢ 0 (IT6_2.3)","EagleⅢ 1 (IT6_2.3)","EagleⅢ 2 (IT6_2.3)","EagleⅢ 2.5 (IT6_2.3)","SparrowⅢ 1MFP (IT6_2.3)","SparrowⅢ 2MFP (IT6_2.3)","SparrowⅢ 2AIO (IT6_2.3)","SparrowⅢ 1/2SFP (IT6_2.3)","EagleBKⅢ 0 (IT6_2.3)","EagleBKⅢ 1 (IT6_2.3)","EagleBKⅢ 2 (IT6_2.3)","SparrowBKⅢ 0 MFP (IT6_2.3)","SparrowBKⅢ 1 MFP (IT6_2.3)","SparrowBKⅢ 0 SFP (IT6_2.3)","Eagle 1 (IT6_2.3.1)","Eagle 2 (IT6_2.3.1)","Eagle 2.5 (IT6_2.3.1)","Sparrow1MFP (IT6_2.3.1)","Sparrow2MFP (IT6_2.3.1)","Sparrow2AIO (IT6_2.3.1)","Sparrow1/2SFP (IT6_2.3.1)","DenebMLK 1 (IT6_2.3.1)","DenebMLK 2 (IT6_2.3.1)","DenebMLK 3 (IT6_2.3.1)","DenebMLK 4 (IT6_2.3.1)","Eagle Z (IT6_2.3.1)","Eagle X (IT6_2.3.1)","Eagle 0 (IT6_2.3.1)","Eagle Z+ (IT6_2.3.1)","EagleBK Z (IT6_2.3.1)","EagleBK X (IT6_2.3.1)","EagleBK 0 (IT6_2.3.1)","EagleBK 1 (IT6_2.3.1)","EagleBK 2 (IT6_2.3.1)","EagleBK Z+ (IT6_2.3.1)","SparrowBK 0 MFP (IT6_2.3.1)","SparrowBK 1 MFP (IT6_2.3.1)","SparrowBK 0 SFP (IT6_2.3.1)","HeliosMLK 2 　中国 (IT6_2.3.1)","HeliosMLK 2.5 中国 (IT6_2.3.1) ","HeliosMLK 3   中国 (IT6_2.3.1) ","HeliosMLK 2.5 欧州 (IT6_2.3.1) ","HeliosMLK 2   その他/日本 (IT6_2.3.1) ","HeliosMLK 3   その他 (IT6_2.3.1) ","HeliosMLK 2.5 その他（FAX/FNS無し）(IT6_2.3.1) ","HeliosMLK 3   その他（FAX/FNS無し）(IT6_2.3.1) ","MinervaSSBK X（IT6_2.3.1）","MinervaSSBK 0（IT6_2.3.1）","EagleⅢ 1 (IT6_2.3.1)","EagleⅢ 2 (IT6_2.3.1)","EagleⅢ 2.5 (IT6_2.3.1)","EagleⅢ Z (IT6_2.3.1)","EagleⅢ X (IT6_2.3.1)","EagleⅢ 0 (IT6_2.3.1)","EagleⅢ Z+ (IT6_2.3.1)","SparrowⅢ 1MFP (IT6_2.3.1)","SparrowⅢ 2MFP (IT6_2.3.1)","SparrowⅢ 2AIO (IT6_2.3.1)","SparrowⅢ 1/2SFP (IT6_2.3.1)","EagleBKⅢ Z (IT6_2.3.1)","EagleBKⅢ X (IT6_2.3.1)","EagleBKⅢ 0 (IT6_2.3.1)","EagleBKⅢ 1 (IT6_2.3.1)","EagleBKⅢ 2 (IT6_2.3.1)","EagleBKⅢ Z+ (IT6_2.3.1)","SparrowBKⅢ 0 MFP (IT6_2.3.1)","SparrowBKⅢ 1 MFP (IT6_2.3.1)","SparrowBKⅢ 0 SFP (IT6_2.3.1)","SparrowH 0 MFP (IT6_2.3.2)\nSparrowH 0MFP (IT6_2.3)",null,"Color","SSD","A3/A4","項目","内容１","内容２","内容３","内容４","備考","変更履歴","SP","F","BIN",4,3,2,1,"Function","Item","Content 1","Content 2","Content 3","Content 4","Note","100版変更","101版変更","102版変更","103版変更","104版変更","106版変更","107版変更","108版変更","112版変更","113版変更","114版変更","117版変更","120版変更","122版変更","123版変更","124版変更","125版変更","126版変更","127版変更","136版変更","137版変更","138版変更","139版変更","140版変更","145版変更","146版変更","147版変更","150版変更","151版変更","152版変更","153版変更","154版変更","155版変更","156版変更","157版変更","158版変更","166版変更","167版変更","183版変更","184版変更","186版変更","187版変更","188版変更","190版変更","194版変更","ユースケース","シーケンス図","制御パターン","関数","文字列","ユースケース","シーケンス図","制御パターン","関数","文字列","ユースケース","シーケンス図","制御パターン","関数","文字列"]
[]
[null,null,null,null,"○","○","○","○","○","○","○","○","○","○","○","○","○","○","○","○","○","○","○","○","○","○","○","○","○","○","○","○","○","○","○","○","○","○","○","○","○","○","○","○","○","○","○","○","○","○","○","○",null,null,null,null,null,"○","○","○","○","○","○","○","○","○",null,null,null,null,null,"○","○","○","○","○","○","○","○","○",null,null,null,null,null,"○","○","○","○","○","○","○","○","○",null,null,null,null,null,"○",null,"○",null,"○",null,"○",null,"○",null,"○",null,"○",null,"○",null,"○",null,"○",null,"○",null,"○",null,"○",null,"○",null,"○",null,"○",null,"○",null,"○",null,null,null,null,null,null,null,"○","○","○",null,null,null,"○","○","○","○","○",null,null,null,"○","○","○","○","○","○","○",null,null,null,"○","○","○","○","○","○","○","○","○","○","○","○","○",null,null,null,"○","○","○","○","○","○","○","○","○","○","○","○","○","○",null,null,null,"○","○","○","○","○","○","○","○","○","○","○","○","○","○","○",null,null,null,"○","○","○","○","○","○","○","○","○","○","○","○","○","○","○",null,null,null,"○","○","○","○","○","○","○","○","○","○","○","○","○","○","○","○",null,null,null,"○","○","○","○","○","○","○","○","○","○","○","○","○","○","○","○","○","○","○","○","○","○",null,null,null,"○","○","○","○","○","○","○","○","○","○","○","○","○","○","○","○","○","○","○","○","○","○","○","○","○","○","○","○","○","×",null,null,null,null,"○","○","○","○","○","○","×",null,null,null,null,"○","○","○","○","○","○","○","○","○","○","○","○","×","○","○","○","○","○","○","○","○","○","○","○","○","○","○","×",null,null,null,null,"○","○","○","○","○","○","○","○","○","×",null,null,null,null,"○","○","○","○","○","○","○","○","○","○","○","○","×","○","○","○","○","○","○","○","○","○","○","○","○","○","○","×",null,null,null,null,"○","○","○","○","○","○","○","○","○","○","○","○","×","○","○","○","○","○","○","○","○","○","○","○","○","○","○","×",null,null,null,null,"○","○","○","○","○","○","○","○","○","○","○","○","×","○","○","○","○","○","○","○","○","○","○","○","○","○","○","○","○","×",null,null,null,null,"○","○","○","○","○","○","○","○","○","○","○","○","×","○","○","○","○","○","○","○","○","○","○","○","○","○","○","×",null,null,null,null,"○","○","○","○","○","○","○","○","○","○","○","○","×","○","○","○","○","○","○","○","○","○","○","○","○","○","○","○","○","○","×","○","○","○","○","○","×","○","○","○","○","○","○","×",null,null,null,null,"○","○","○","○","○","○","○","○","○","○","○","○","×","○","○","○","○","○","○","○","○","○","○","○","○","○","○","○","○","○","○","○","○","×","○","○","○","○","○","○","○","○","×","○",null,null,null,null,"【文書番号】"]
[null,null,null,null,"○","○","○","○","○","○","○","○","○","○","○","○","○","○","○","○","○","○","○","○","○","○","○","○","○","○","○","○","○","○","○","○","○","○","○","○","○","○","○","○","○","○","○","○","○","○","○","○",null,null,null,null,null,"○","○","○","○","○","○","○","○","○",null,null,null,null,null,"○","○","○","○","○","○","○","○","○",null,null,null,null,null,"○","○","○","○","○","○","○","○","○",null,null,null,null,null,"○",null,"○",null,"○",null,"○",null,"○",null,"○",null,"○",null,"○",null,"○",null,"○",null,"○",null,"○",null,"○",null,"○",null,"○",null,"○",null,"○",null,"○",null,null,null,null,null,null,null,"○","○","○",null,null,null,"○","○","○","○","○",null,null,null,"○","○","○","○","○","○","○",null,null,null,"○","○","○","○","○","○","○","○","○","○","○","○","○",null,null,null,"○","○","○","○","○","○","○","○","○","○","○","○","○","○",null,null,null,"○","○","○","○","○","○","○","○","○","○","○","○","○","○","○",null,null,null,"○","○","○","○","○","○","○","○","○","○","○","○","○","○","○",null,null,null,"○","○","○","○","○","○","○","○","○","○","○","○","○","○","○","○",null,null,null,"○","○","○","○","○","○","○","○","○","○","○","○","○","○","○","○","○","○","○","○","○","○",null,null,null,"○","○","○","○","○","○","○","○","○","○","○","○","○","○","○","○","○","○","○","○","○","○","○","○","○","○","○","○","○","×",null,null,null,null,"○","○","○","○","○","○","×",null,null,null,null,"○","○","○","○","○","○","○","○","○","○","○","○","×","○","○","○","○","○","○","○","○","○","○","○","○","○","○","×",null,null,null,null,"○","○","○","○","○","○","○","○","○","×",null,null,null,null,"○","○","○","○","○","○","○","○","○","○","○","○","×","○","○","○","○","○","○","○","○","○","○","○","○","○","○","×",null,null,null,null,"○","○","○","○","○","○","○","○","○","○","○","○","×","○","○","○","○","○","○","○","○","○","○","○","○","○","○","×",null,null,null,null,"○","○","○","○","○","○","○","○","○","○","○","○","×","○","○","○","○","○","○","○","○","○","○","○","○","○","○","○","○","×",null,null,null,null,"○","○","○","○","○","○","○","○","○","○","○","○","×","○","○","○","○","○","○","○","○","○","○","○","○","○","○","×",null,null,null,null,"○","○","○","○","○","○","○","○","○","○","○","○","×","○","○","○","○","○","○","○","○","○","○","○","○","○","○","○","○","○","×","○","○","○","○","○","×","○","○","○","○","○","○","×",null,null,null,null,"○","○","○","○","○","○","○","○","○","○","○","○","×","○","○","○","○","○","○","○","○","○","○","○","○","○","○","○","○","○","○","○","○","×","○","○","○","○","○","○","○","○","×","○",null,null,null,null,"【残存課題】"]
[null,null,null,null,"○","○","○","○","○","○","○","○","○","○","○","○","○","○","○","○","○","○","○","○","○","○","○","○","○","○","○","○","○","○","○","○","○","○","○","○","○","○","○","○","○","○","○","○","○","○","○","○",null,null,null,null,null,"○","○","○","○","○","○","○","○","○",null,null,null,null,null,"○","○","○","○","○","○","○","○","○",null,null,null,null,null,"○","○","○","○","○","○","○","○","○",null,null,null,null,null,"○",null,"○",null,"○",null,"○",null,"○",null,"○",null,"○",null,"○",null,"○",null,"○",null,"○",null,"○",null,"○",null,"○",null,"○",null,"○",null,"○",null,"○",null,null,null,null,null,null,null,"○","○","○",null,null,null,"○","○","○","○","○",null,null,null,"○","○","○","○","○","○","○",null,null,null,"○","○","○","○","○","○","○","○","○","○","○","○","○",null,null,null,"○","○","○","○","○","○","○","○","○","○","○","○","○","○",null,null,null,"○","○","○","○","○","○","○","○","○","○","○","○","○","○","○",null,null,null,"○","○","○","○","○","○","○","○","○","○","○","○","○","○","○",null,null,null,"○","○","○","○","○","○","○","○","○","○","○","○","○","○","○","○",null,null,null,"○","○","○","○","○","○","○","○","○","○","○","○","○","○","○","○","○","○","○","○","○","○",null,null,null,"○","○","○","○","○","○","○","○","○","○","○","○","○","○","○","○","○","○","○","○","○","○","○","○","○","○","○","○","○","×",null,null,null,null,"○","○","○","○","○","○","×",null,null,null,null,"○","○","○","○","○","○","○","○","○","○","○","○","×","○","○","○","○","○","○","○","○","○","○","○","○","○","○","×",null,null,null,null,"○","○","○","○","○","○","○","○","○","×",null,null,null,null,"○","○","○","○","○","○","○","○","○","○","○","○","×","○","○","○","○","○","○","○","○","○","○","○","○","○","○","×",null,null,null,null,"○","○","○","○","○","○","○","○","○","○","○","○","×","○","○","○","○","○","○","○","○","○","○","○","○","○","○","×",null,null,null,null,"○","○","○","○","○","○","○","○","○","○","○","○","×","○","○","○","○","○","○","○","○","○","○","○","○","○","○","○","○","×",null,null,null,null,"○","○","○","○","○","○","○","○","○","○","○","○","×","○","○","○","○","○","○","○","○","○","○","○","○","○","○","×",null,null,null,null,"○","○","○","○","○","○","○","○","○","○","○","○","×","○","○","○","○","○","○","○","○","○","○","○","○","○","○","○","○","○","×","○","○","○","○","○","×","○","○","○","○","○","○","×",null,null,null,null,"○","○","○","○","○","○","○","○","○","○","○","○","×","○","○","○","○","○","○","○","○","○","○","○","○","○","○","○","○","○","○","○","○","×","○","○","○","○","○","○","○","○","×","○",null,null,null,null,"【背景・目的】\n(評価対象外)"]
[null,null,null,null,"○","○","○","○","○","○","○","○","○","○","○","○","○","○","○","○","○","○","○","○","○","○","○","○","○","○","○","○","○","○","○","○","○","○","○","○","○","○","○","○","○","○","○","○","○","○","○","○",null,null,null,null,null,"○","○","○","○","○","○","○","○","○",null,null,null,null,null,"○","○","○","○","○","○","○","○","○",null,null,null,null,null,"○","○","○","○","○","○","○","○","○",null,null,null,null,null,"○",null,"○",null,"○",null,"○",null,"○",null,"○",null,"○",null,"○",null,"○",null,"○",null,"○",null,"○",null,"○",null,"○",null,"○",null,"○",null,"○",null,"○",null,null,null,null,null,null,null,"○","○","○",null,null,null,"○","○","○","○","○",null,null,null,"○","○","○","○","○","○","○",null,null,null,"○","○","○","○","○","○","○","○","○","○","○","○","○",null,null,null,"○","○","○","○","○","○","○","○","○","○","○","○","○","○",null,null,null,"○","○","○","○","○","○","○","○","○","○","○","○","○","○","○",null,null,null,"○","○","○","○","○","○","○","○","○","○","○","○","○","○","○",null,null,null,"○","○","○","○","○","○","○","○","○","○","○","○","○","○","○","○",null,null,null,"○","○","○","○","○","○","○","○","○","○","○","○","○","○","○","○","○","○","○","○","○","○",null,null,null,"○","○","○","○","○","○","○","○","○","○","○","○","○","○","○","○","○","○","○","○","○","○","○","○","○","○","○","○","○","×",null,null,null,null,"○","○","○","○","○","○","×",null,null,null,null,"○","○","○","○","○","○","○","○","○","○","○","○","×","○","○","○","○","○","○","○","○","○","○","○","○","○","○","×",null,null,null,null,"○","○","○","○","○","○","○","○","○","×",null,null,null,null,"○","○","○","○","○","○","○","○","○","○","○","○","×","○","○","○","○","○","○","○","○","○","○","○","○","○","○","×",null,null,null,null,"○","○","○","○","○","○","○","○","○","○","○","○","×","○","○","○","○","○","○","○","○","○","○","○","○","○","○","×",null,null,null,null,"○","○","○","○","○","○","○","○","○","○","○","○","×","○","○","○","○","○","○","○","○","○","○","○","○","○","○","○","○","×",null,null,null,null,"○","○","○","○","○","○","○","○","○","○","○","○","×","○","○","○","○","○","○","○","○","○","○","○","○","○","○","×",null,null,null,null,"○","○","○","○","○","○","○","○","○","○","○","○","×","○","○","○","○","○","○","○","○","○","○","○","○","○","○","○","○","○","×","○","○","○","○","○","×","○","○","○","○","○","○","×",null,null,null,null,"○","○","○","○","○","○","○","○","○","○","○","○","×","○","○","○","○","○","○","○","○","○","○","○","○","○","○","○","○","○","○","○","○","×","○","○","○","○","○","○","○","○","×","○",null,null,null,null,"【適　　用】"]
[null,null,null,null,"○","○","○","○","○","○","○","○","○","○","○","○","○","○","○","○","○","○","○","○","○","○","○","○","○","○","○","○","○","○","○","○","○","○","○","○","○","○","○","○","○","○","○","○","○","○","○","○",null,null,null,null,null,"○","○","○","○","○","○","○","○","○",null,null,null,null,null,"○","○","○","○","○","○","○","○","○",null,null,null,null,null,"○","○","○","○","○","○","○","○","○",null,null,null,null,null,"○",null,"○",null,"○",null,"○",null,"○",null,"○",null,"○",null,"○",null,"○",null,"○",null,"○",null,"○",null,"○",null,"○",null,"○",null,"○",null,"○",null,"○",null,null,null,null,null,null,null,"○","○","○",null,null,null,"○","○","○","○","○",null,null,null,"○","○","○","○","○","○","○",null,null,null,"○","○","○","○","○","○","○","○","○","○","○","○","○",null,null,null,"○","○","○","○","○","○","○","○","○","○","○","○","○","○",null,null,null,"○","○","○","○","○","○","○","○","○","○","○","○","○","○","○",null,null,null,"○","○","○","○","○","○","○","○","○","○","○","○","○","○","○",null,null,null,"○","○","○","○","○","○","○","○","○","○","○","○","○","○","○","○",null,null,null,"○","○","○","○","○","○","○","○","○","○","○","○","○","○","○","○","○","○","○","○","○","○",null,null,null,"○","○","○","○","○","○","○","○","○","○","○","○","○","○","○","○","○","○","○","○","○","○","○","○","○","○","○","○","○","×",null,null,null,null,"○","○","○","○","○","○","×",null,null,null,null,"○","○","○","○","○","○","○","○","○","○","○","○","×","○","○","○","○","○","○","○","○","○","○","○","○","○","○","×",null,null,null,null,"○","○","○","○","○","○","○","○","○","×",null,null,null,null,"○","○","○","○","○","○","○","○","○","○","○","○","×","○","○","○","○","○","○","○","○","○","○","○","○","○","○","×",null,null,null,null,"○","○","○","○","○","○","○","○","○","○","○","○","×","○","○","○","○","○","○","○","○","○","○","○","○","○","○","×",null,null,null,null,"○","○","○","○","○","○","○","○","○","○","○","○","×","○","○","○","○","○","○","○","○","○","○","○","○","○","○","○","○","×",null,null,null,null,"○","○","○","○","○","○","○","○","○","○","○","○","×","○","○","○","○","○","○","○","○","○","○","○","○","○","○","×",null,null,null,null,"○","○","○","○","○","○","○","○","○","○","○","○","×","○","○","○","○","○","○","○","○","○","○","○","○","○","○","○","○","○","×","○","○","○","○","○","×","○","○","○","○","○","○","×",null,null,null,null,"○","○","○","○","○","○","○","○","○","○","○","○","×","○","○","○","○","○","○","○","○","○","○","○","○","○","○","○","○","○","○","○","○","×","○","○","○","○","○","○","○","○","×","○",null,null,null,null,"【機　　能】"]
[null,null,null,null,"○","○","○","○","○","○","○","○","○","○","○","○","○","○","○","○","○","○","○","○","○","○","○","○","○","○","○","○","○","○","○","○","○","○","○","○","○","○","○","○","○","○","○","○","○","○","○","○",null,null,null,null,null,"○","○","○","○","○","○","○","○","○",null,null,null,null,null,"○","○","○","○","○","○","○","○","○",null,null,null,null,null,"○","○","○","○","○","○","○","○","○",null,null,null,null,null,"○",null,"○",null,"○",null,"○",null,"○",null,"○",null,"○",null,"○",null,"○",null,"○",null,"○",null,"○",null,"○",null,"○",null,"○",null,"○",null,"○",null,"○",null,null,null,null,null,null,null,"○","○","○",null,null,null,"○","○","○","○","○",null,null,null,"○","○","○","○","○","○","○",null,null,null,"○","○","○","○","○","○","○","○","○","○","○","○","○",null,null,null,"○","○","○","○","○","○","○","○","○","○","○","○","○","○",null,null,null,"○","○","○","○","○","○","○","○","○","○","○","○","○","○","○",null,null,null,"○","○","○","○","○","○","○","○","○","○","○","○","○","○","○",null,null,null,"○","○","○","○","○","○","○","○","○","○","○","○","○","○","○","○",null,null,null,"○","○","○","○","○","○","○","○","○","○","○","○","○","○","○","○","○","○","○","○","○","○",null,null,null,"○","○","○","○","○","○","○","○","○","○","○","○","○","○","○","○","○","○","○","○","○","○","○","○","○","○","○","○","○","×",null,null,null,null,"○","○","○","○","○","○","×",null,null,null,null,"○","○","○","○","○","○","○","○","○","○","○","○","×","○","○","○","○","○","○","○","○","○","○","○","○","○","○","×",null,null,null,null,"○","○","○","○","○","○","○","○","○","×",null,null,null,null,"○","○","○","○","○","○","○","○","○","○","○","○","×","○","○","○","○","○","○","○","○","○","○","○","○","○","○","×",null,null,null,null,"○","○","○","○","○","○","○","○","○","○","○","○","×","○","○","○","○","○","○","○","○","○","○","○","○","○","○","×",null,null,null,null,"○","○","○","○","○","○","○","○","○","○","○","○","×","○","○","○","○","○","○","○","○","○","○","○","○","○","○","○","○","×",null,null,null,null,"○","○","○","○","○","○","○","○","○","○","○","○","×","○","○","○","○","○","○","○","○","○","○","○","○","○","○","×",null,null,null,null,"○","○","○","○","○","○","○","○","○","○","○","○","×","○","○","○","○","○","○","○","○","○","○","○","○","○","○","○","○","○","×","○","○","○","○","○","×","○","○","○","○","○","○","×",null,null,null,null,"○","○","○","○","○","○","○","○","○","○","○","○","×","○","○","○","○","○","○","○","○","○","○","○","○","○","○","○","○","○","○","○","○","×","○","○","○","○","○","○","○","○","×","○",null,null,null,null,"【受付条件】"]
[null,null,null,null,"○","○","○","○","○","○","○","○","○","○","○","○","○","○","○","○","○","○","○","○","○","○","○","○","○","○","○","○","○","○","○","○","○","○","○","○","○","○","○","○","○","○","○","○","○","○","○","○",null,null,null,null,null,"○","○","○","○","○","○","○","○","○",null,null,null,null,null,"○","○","○","○","○","○","○","○","○",null,null,null,null,null,"○","○","○","○","○","○","○","○","○",null,null,null,null,null,"○",null,"○",null,"○",null,"○",null,"○",null,"○",null,"○",null,"○",null,"○",null,"○",null,"○",null,"○",null,"○",null,"○",null,"○",null,"○",null,"○",null,"○",null,null,null,null,null,null,null,"○","○","○",null,null,null,"○","○","○","○","○",null,null,null,"○","○","○","○","○","○","○",null,null,null,"○","○","○","○","○","○","○","○","○","○","○","○","○",null,null,null,"○","○","○","○","○","○","○","○","○","○","○","○","○","○",null,null,null,"○","○","○","○","○","○","○","○","○","○","○","○","○","○","○",null,null,null,"○","○","○","○","○","○","○","○","○","○","○","○","○","○","○",null,null,null,"○","○","○","○","○","○","○","○","○","○","○","○","○","○","○","○",null,null,null,"○","○","○","○","○","○","○","○","○","○","○","○","○","○","○","○","○","○","○","○","○","○",null,null,null,"○","○","○","○","○","○","○","○","○","○","○","○","○","○","○","○","○","○","○","○","○","○","○","○","○","○","○","○","○","×",null,null,null,null,"○","○","○","○","○","○","×",null,null,null,null,"○","○","○","○","○","○","○","○","○","○","○","○","×","○","○","○","○","○","○","○","○","○","○","○","○","○","○","×",null,null,null,null,"○","○","○","○","○","○","○","○","○","×",null,null,null,null,"○","○","○","○","○","○","○","○","○","○","○","○","×","○","○","○","○","○","○","○","○","○","○","○","○","○","○","×",null,null,null,null,"○","○","○","○","○","○","○","○","○","○","○","○","×","○","○","○","○","○","○","○","○","○","○","○","○","○","○","×",null,null,null,null,"○","○","○","○","○","○","○","○","○","○","○","○","×","○","○","○","○","○","○","○","○","○","○","○","○","○","○","○","○","×",null,null,null,null,"○","○","○","○","○","○","○","○","○","○","○","○","×","○","○","○","○","○","○","○","○","○","○","○","○","○","○","×",null,null,null,null,"○","○","○","○","○","○","○","○","○","○","○","○","×","○","○","○","○","○","○","○","○","○","○","○","○","○","○","○","○","○","×","○","○","○","○","○","×","○","○","○","○","○","○","×",null,null,null,null,"○","○","○","○","○","○","○","○","○","○","○","○","×","○","○","○","○","○","○","○","○","○","○","○","○","○","○","○","○","○","○","○","○","×","○","○","○","○","○","○","○","○","×","○",null,null,null,null,"【設定範囲】"]
[null,null,null,null,"○","○","○","○","○","○","○","○","○","○","○","○","○","○","○","○","○","○","○","○","○","○","○","○","○","○","○","○","○","○","○","○","○","○","○","○","○","○","○","○","○","○","○","○","○","○","○","○",null,null,null,null,null,"○","○","○","○","○","○","○","○","○",null,null,null,null,null,"○","○","○","○","○","○","○","○","○",null,null,null,null,null,"○","○","○","○","○","○","○","○","○",null,null,null,null,null,"○",null,"○",null,"○",null,"○",null,"○",null,"○",null,"○",null,"○",null,"○",null,"○",null,"○",null,"○",null,"○",null,"○",null,"○",null,"○",null,"○",null,"○",null,null,null,null,null,null,null,"○","○","○",null,null,null,"○","○","○","○","○",null,null,null,"○","○","○","○","○","○","○",null,null,null,"○","○","○","○","○","○","○","○","○","○","○","○","○",null,null,null,"○","○","○","○","○","○","○","○","○","○","○","○","○","○",null,null,null,"○","○","○","○","○","○","○","○","○","○","○","○","○","○","○",null,null,null,"○","○","○","○","○","○","○","○","○","○","○","○","○","○","○",null,null,null,"○","○","○","○","○","○","○","○","○","○","○","○","○","○","○","○",null,null,null,"○","○","○","○","○","○","○","○","○","○","○","○","○","○","○","○","○","○","○","○","○","○",null,null,null,"○","○","○","○","○","○","○","○","○","○","○","○","○","○","○","○","○","○","○","○","○","○","○","○","○","○","○","○","○","×",null,null,null,null,"○","○","○","○","○","○","×",null,null,null,null,"○","○","○","○","○","○","○","○","○","○","○","○","×","○","○","○","○","○","○","○","○","○","○","○","○","○","○","×",null,null,null,null,"○","○","○","○","○","○","○","○","○","×",null,null,null,null,"○","○","○","○","○","○","○","○","○","○","○","○","×","○","○","○","○","○","○","○","○","○","○","○","○","○","○","×",null,null,null,null,"○","○","○","○","○","○","○","○","○","○","○","○","×","○","○","○","○","○","○","○","○","○","○","○","○","○","○","×",null,null,null,null,"○","○","○","○","○","○","○","○","○","○","○","○","×","○","○","○","○","○","○","○","○","○","○","○","○","○","○","○","○","×",null,null,null,null,"○","○","○","○","○","○","○","○","○","○","○","○","×","○","○","○","○","○","○","○","○","○","○","○","○","○","○","×",null,null,null,null,"○","○","○","○","○","○","○","○","○","○","○","○","×","○","○","○","○","○","○","○","○","○","○","○","○","○","○","○","○","○","×","○","○","○","○","○","×","○","○","○","○","○","○","×",null,null,null,null,"○","○","○","○","○","○","○","○","○","○","○","○","×","○","○","○","○","○","○","○","○","○","○","○","○","○","○","○","○","○","○","○","○","×","○","○","○","○","○","○","○","○","×","○",null,null,null,null,"【詳　　細】"]
[null,null,null,null,"○","○","○","○","○","○","○","○","○","○","○","○","○","○","○","○","○","○","○","○","○","○","○","○","○","○","○","○","○","○","○","○","○","○","○","○","○","○","○","○","○","○","○","○","○","○","○","○",null,null,null,null,null,"○","○","○","○","○","○","○","○","○",null,null,null,null,null,"○","○","○","○","○","○","○","○","○",null,null,null,null,null,"○","○","○","○","○","○","○","○","○",null,null,null,null,null,"○",null,"○",null,"○",null,"○",null,"○",null,"○",null,"○",null,"○",null,"○",null,"○",null,"○",null,"○",null,"○",null,"○",null,"○",null,"○",null,"○",null,"○",null,null,null,null,null,null,null,"○","○","○",null,null,null,"○","○","○","○","○",null,null,null,"○","○","○","○","○","○","○",null,null,null,"○","○","○","○","○","○","○","○","○","○","○","○","○",null,null,null,"○","○","○","○","○","○","○","○","○","○","○","○","○","○",null,null,null,"○","○","○","○","○","○","○","○","○","○","○","○","○","○","○",null,null,null,"○","○","○","○","○","○","○","○","○","○","○","○","○","○","○",null,null,null,"○","○","○","○","○","○","○","○","○","○","○","○","○","○","○","○",null,null,null,"○","○","○","○","○","○","○","○","○","○","○","○","○","○","○","○","○","○","○","○","○","○",null,null,null,"○","○","○","○","○","○","○","○","○","○","○","○","○","○","○","○","○","○","○","○","○","○","○","○","○","○","○","○","○","×",null,null,null,null,"○","○","○","○","○","○","×",null,null,null,null,"○","○","○","○","○","○","○","○","○","○","○","○","×","○","○","○","○","○","○","○","○","○","○","○","○","○","○","×",null,null,null,null,"○","○","○","○","○","○","○","○","○","×",null,null,null,null,"○","○","○","○","○","○","○","○","○","○","○","○","×","○","○","○","○","○","○","○","○","○","○","○","○","○","○","×",null,null,null,null,"○","○","○","○","○","○","○","○","○","○","○","○","×","○","○","○","○","○","○","○","○","○","○","○","○","○","○","×",null,null,null,null,"○","○","○","○","○","○","○","○","○","○","○","○","×","○","○","○","○","○","○","○","○","○","○","○","○","○","○","○","○","×",null,null,null,null,"○","○","○","○","○","○","○","○","○","○","○","○","×","○","○","○","○","○","○","○","○","○","○","○","○","○","○","×",null,null,null,null,"○","○","○","○","○","○","○","○","○","○","○","○","×","○","○","○","○","○","○","○","○","○","○","○","○","○","○","○","○","○","×","○","○","○","○","○","×","○","○","○","○","○","○","×",null,null,null,null,"○","○","○","○","○","○","○","○","○","○","○","○","×","○","○","○","○","○","○","○","○","○","○","○","○","○","○","○","○","○","○","○","○","×","○","○","○","○","○","○","○","○","×","○",null,null,null,null,"【参　　考】\n(評価対象外)",null,null,null,null,null,null,null,null,{"$f":"IF(WF11=\"\",\"\",DEC2BIN(WF11,4))","v":""},{"$f":"IF($VX11=\"\",\"\",VALUE(MID($VX11,1,1)))","v":{"$error":"#VALUE!"}},{"$f":"IF($VX11=\"\",\"\",VALUE(MID($VX11,2,1)))","v":{"$error":"#VALUE!"}},{"$f":"IF($VX11=\"\",\"\",VALUE(MID($VX11,3,1)))","v":{"$error":"#VALUE!"}},{"$f":"IF($VX11=\"\",\"\",VALUE(MID($VX11,4,1)))","v":{"$error":"#VALUE!"}}]
[null,null,null,null,"○","○","○","○","○","○","○","○","○","○","○","○","○","○","○","○","○","○","○","○","○","○","○","○","○","○","○","○","○","○","○","○","○","○","○","○","○","○","○","○","○","○","○","○","○","○","○","○",null,null,null,null,null,"○","○","○","○","○","○","○","○","○",null,null,null,null,null,"○","○","○","○","○","○","○","○","○",null,null,null,null,null,"○","○","○","○","○","○","○","○","○",null,null,null,null,null,"○",null,"○",null,"○",null,"○",null,"○",null,"○",null,"○",null,"○",null,"○",null,"○",null,"○",null,"○",null,"○",null,"○",null,"○",null,"○",null,"○",null,"○",null,null,null,null,null,null,null,"○","○","○",null,null,null,"○","○","○","○","○",null,null,null,"○","○","○","○","○","○","○",null,null,null,"○","○","○","○","○","○","○","○","○","○","○","○","○",null,null,null,"○","○","○","○","○","○","○","○","○","○","○","○","○","○",null,null,null,"○","○","○","○","○","○","○","○","○","○","○","○","○","○","○",null,null,null,"○","○","○","○","○","○","○","○","○","○","○","○","○","○","○",null,null,null,"○","○","○","○","○","○","○","○","○","○","○","○","○","○","○","○",null,null,null,"○","○","○","○","○","○","○","○","○","○","○","○","○","○","○","○","○","○","○","○","○","○",null,null,null,"○","○","○","○","○","○","○","○","○","○","○","○","○","○","○","○","○","○","○","○","○","○","○","○","○","○","○","○","○","×",null,null,null,null,"○","○","○","○","○","○","×",null,null,null,null,"○","○","○","○","○","○","○","○","○","○","○","○","×","○","○","○","○","○","○","○","○","○","○","○","○","○","○","×",null,null,null,null,"○","○","○","○","○","○","○","○","○","×",null,null,null,null,"○","○","○","○","○","○","○","○","○","○","○","○","×","○","○","○","○","○","○","○","○","○","○","○","○","○","○","×",null,null,null,null,"○","○","○","○","○","○","○","○","○","○","○","○","×","○","○","○","○","○","○","○","○","○","○","○","○","○","○","×",null,null,null,null,"○","○","○","○","○","○","○","○","○","○","○","○","×","○","○","○","○","○","○","○","○","○","○","○","○","○","○","○","○","×",null,null,null,null,"○","○","○","○","○","○","○","○","○","○","○","○","×","○","○","○","○","○","○","○","○","○","○","○","○","○","○","×",null,null,null,null,"○","○","○","○","○","○","○","○","○","○","○","○","×","○","○","○","○","○","○","○","○","○","○","○","○","○","○","○","○","○","×","○","○","○","○","○","×","○","○","○","○","○","○","×",null,null,null,null,"○","○","○","○","○","○","○","○","○","○","○","○","×","○","○","○","○","○","○","○","○","○","○","○","○","○","○","○","○","○","○","○","○","×","○","○","○","○","○","○","○","○","×","○",null,null,null,null,"【メ　　モ】\n(評価対象外)",null,null,null,null,null,null,null,null,"",{"$error":"#VALUE!"},{"$error":"#VALUE!"},{"$error":"#VALUE!"},{"$error":"#VALUE!"}]
[null,null,null,null,"○","○","○","○","○","○","○","○","○","○","○","○","○","○","○","○","○","○","○","○","○","○","○","○","○","○","○","○","○","○","○","○","○","○","○","○","○","○","○","○","○","○","○","○","○","○","○","○",null,null,null,null,null,"○","○","○","○","○","○","○","○","○",null,null,null,null,null,"○","○","○","○","○","○","○","○","○",null,null,null,null,null,"○","○","○","○","○","○","○","○","○",null,null,null,null,null,"○",null,"○",null,"○",null,"○",null,"○",null,"○",null,"○",null,"○",null,"○",null,"○",null,"○",null,"○",null,"○",null,"○",null,"○",null,"○",null,"○",null,"○",null,null,null,null,null,null,null,"○","○","○",null,null,null,"○","○","○","○","○",null,null,null,"○","○","○","○","○","○","○",null,null,null,"○","○","○","○","○","○","○","○","○","○","○","○","○",null,null,null,"○","○","○","○","○","○","○","○","○","○","○","○","○","○",null,null,null,"○","○","○","○","○","○","○","○","○","○","○","○","○","○","○",null,null,null,"○","○","○","○","○","○","○","○","○","○","○","○","○","○","○",null,null,null,"○","○","○","○","○","○","○","○","○","○","○","○","○","○","○","○",null,null,null,"○","○","○","○","○","○","○","○","○","○","○","○","○","○","○","○","○","○","○","○","○","○",null,null,null,"○","○","○","○","○","○","○","○","○","○","○","○","○","○","○","○","○","○","○","○","○","○","○","○","○","○","○","○","○","×",null,null,null,null,"○","○","○","○","○","○","×",null,null,null,null,"○","○","○","○","○","○","○","○","○","○","○","○","×","○","○","○","○","○","○","○","○","○","○","○","○","○","○","×",null,null,null,null,"○","○","○","○","○","○","○","○","○","×",null,null,null,null,"○","○","○","○","○","○","○","○","○","○","○","○","×","○","○","○","○","○","○","○","○","○","○","○","○","○","○","×",null,null,null,null,"○","○","○","○","○","○","○","○","○","○","○","○","×","○","○","○","○","○","○","○","○","○","○","○","○","○","○","×",null,null,null,null,"○","○","○","○","○","○","○","○","○","○","○","○","×","○","○","○","○","○","○","○","○","○","○","○","○","○","○","○","○","×",null,null,null,null,"○","○","○","○","○","○","○","○","○","○","○","○","×","○","○","○","○","○","○","○","○","○","○","○","○","○","○","×",null,null,null,null,"○","○","○","○","○","○","○","○","○","○","○","○","×","○","○","○","○","○","○","○","○","○","○","○","○","○","○","○","○","○","×","○","○","○","○","○","×","○","○","○","○","○","○","×",null,null,null,null,"○","○","○","○","○","○","○","○","○","○","○","○","×","○","○","○","○","○","○","○","○","○","○","○","○","○","○","○","○","○","○","○","○","×","○","○","○","○","○","○","○","○","×","○",null,null,null,null,"【履　　歴】\n(評価対象外)",null,null,null,null,null,null,null,null,"",{"$error":"#VALUE!"},{"$error":"#VALUE!"},{"$error":"#VALUE!"},{"$error":"#VALUE!"}]
[2,"1.スキャナ関連",null,"○","○","○","○","○","○","○","○","○","○","○","○","○","○","○","○","○","○","○","○","○","○","○","○","○","○","○","○","○","○","○","○","○","○","○","○","○","○","○","○","○","○","○","○","○","○","○","○","○","○","○","○","○","○","○","○","○","○","○","○","○","○","○","○","○","○","○","○","○","○","○","○","○","○","○","○","○","○","○","○","○","○","○","○","○","○","○","○","○","○","○","○","○","○","○","○","○","","○","","○","","○","","○","","○","","○","","○","","○","","○","","○","","○","","○","","○","","○","","○","","○","","○","","○","○","○","○","○","○","○","○","○","○","○","○","○","○","○","○","○","○","○","○","○","○","○","○","○","○","○","○","○","○","○","○","○","○","○","○","○","○","○","○","○","○","○","○","○","○","○","○","○","○","○","○","○","○","○","○","○","○","○","○","○","○","○","○","○","○","○","○","○","○","○","○","○","○","○","○","○","○","○","○","○","○","○","○","○","○","○","○","○","○","○","○","○","○","○","○","○","○","○","○","○","○","○","○","○","○","○","○","○","○","○","○","○","○","○","○","○","○","○","○","○","○","○","○","○","○","○","○","○","○","○","○","○","○","○","○","○","○","○","○","○","○","○","○","○","○","○","○","○","○","○","○","○","○","○","○","○","○","○","○","○","○","○","○","○","○","○","○","○","○","○","○","×","○","○","○","○","○","○","○","○","○","○","×","○","○","○","○","○","○","○","○","○","○","○","○","○","○","○","○","×","○","○","○","○","○","○","○","○","○","○","○","○","○","○","×","○","○","○","○","○","○","○","○","○","○","○","○","○","×","○","○","○","○","○","○","○","○","○","○","○","○","○","○","○","○","×","○","○","○","○","○","○","○","○","○","○","○","○","○","○","×","○","○","○","○","○","○","○","○","○","○","○","○","○","○","○","○","×","○","○","○","○","○","○","○","○","○","○","○","○","○","○","×","○","○","○","○","○","○","○","○","○","○","○","○","○","○","○","○","×","○","○","○","○","○","○","○","○","○","○","○","○","○","○","○","○","×","○","○","○","○","○","○","○","○","○","○","○","○","○","○","○","○","×","○","○","○","○","○","○","○","○","○","○","○","○","○","○","×","○","○","○","○","○","○","○","○","○","○","○","○","○","○","○","○","×","○","○","○","○","○","○","○","○","○","○","○","○","○","○","○","○","○","×","○","○","○","○","○","×","○","○","○","○","○","○","×","○","○","○","○","○","○","○","○","○","○","○","○","○","○","○","○","×","○","○","○","○","○","○","○","○","○","○","○","○","○","○","○","○","○","○","○","○","×","○","○","○","○","○","○","○","○","×","○",null,"A",null,null,null,null,null,null,null,null,null,null,null,{"$f":"IF(WF14=\"\",\"\",DEC2BIN(WF14,4))","v":""},{"$f":"IF($WG14=\"\",\"\",VALUE(MID($WG14,1,1)))","v":""},{"$f":"IF($WG14=\"\",\"\",VALUE(MID($WG14,2,1)))","v":""},{"$f":"IF($WG14=\"\",\"\",VALUE(MID($WG14,3,1)))","v":""},{"$f":"IF($WG14=\"\",\"\",VALUE(MID($WG14,4,1)))","v":""}]
[3,"1.1.ネットワークスキャナの定義","ネットワークスキャナの位置づけ","○","○","○","○","○","○","○","○","○","○","○","○","○","○","○","○","○","○","○","○","○","○","○","○","○","○","○","○","○","○","○","○","○","○","○","○","○","○","○","○","○","○","○","○","○","○","○","○","○","○","○","○","○","○","○","○","○","○","○","○","○","○","○","○","○","○","○","○","○","○","○","○","○","○","○","○","○","○","○","○","○","○","○","○","○","○","○","○","○","○","○","○","○","○","○","○","○","","○","","○","","○","","○","","○","","○","","○","","○","","○","","○","","○","","○","","○","","○","","○","","○","","○","","○","○","○","○","○","○","○","○","○","○","○","○","○","○","○","○","○","○","○","○","○","○","○","○","○","○","○","○","○","○","○","○","○","○","○","○","○","○","○","○","○","○","○","○","○","○","○","○","○","○","○","○","○","○","○","○","○","○","○","○","○","○","○","○","○","○","○","○","○","○","○","○","○","○","○","○","○","○","○","○","○","○","○","○","○","○","○","○","○","○","○","○","○","○","○","○","○","○","○","○","○","○","○","○","○","○","○","○","○","○","○","○","○","○","○","○","○","○","○","○","○","○","○","○","○","○","○","○","○","○","○","○","○","○","○","○","○","○","○","○","○","○","○","○","○","○","○","○","○","○","○","○","○","○","○","○","○","○","○","○","○","○","○","○","○","○","○","○","○","○","○","○","×","○","○","○","○","○","○","○","○","○","○","×","○","○","○","○","○","○","○","○","○","○","○","○","○","○","○","○","×","○","○","○","○","○","○","○","○","○","○","○","○","○","○","×","○","○","○","○","○","○","○","○","○","○","○","○","○","×","○","○","○","○","○","○","○","○","○","○","○","○","○","○","○","○","×","○","○","○","○","○","○","○","○","○","○","○","○","○","○","×","○","○","○","○","○","○","○","○","○","○","○","○","○","○","○","○","×","○","○","○","○","○","○","○","○","○","○","○","○","○","○","×","○","○","○","○","○","○","○","○","○","○","○","○","○","○","○","○","×","○","○","○","○","○","○","○","○","○","○","○","○","○","○","○","○","×","○","○","○","○","○","○","○","○","○","○","○","○","○","○","○","○","×","○","○","○","○","○","○","○","○","○","○","○","○","○","○","×","○","○","○","○","○","○","○","○","○","○","○","○","○","○","○","○","×","○","○","○","○","○","○","○","○","○","○","○","○","○","○","○","○","○","×","○","○","○","○","○","×","○","○","○","○","○","○","×","○","○","○","○","○","○","○","○","○","○","○","○","○","○","○","○","×","○","○","○","○","○","○","○","○","○","○","○","○","○","○","○","○","○","○","○","○","×","○","○","○","○","○","○","○","○","×","○",null,"A",null,null,"【文書番号】",null,null,null,null,null,null,null,1,{"$f":"IF(WF15=\"\",\"\",DEC2BIN(WF15,4))","v":"0001"},{"$f":"IF($WG15=\"\",\"\",VALUE(MID($WG15,1,1)))","v":0},{"$f":"IF($WG15=\"\",\"\",VALUE(MID($WG15,2,1)))","v":0},{"$f":"IF($WG15=\"\",\"\",VALUE(MID($WG15,3,1)))","v":0},{"$f":"IF($WG15=\"\",\"\",VALUE(MID($WG15,4,1)))","v":1}]
[4,null,null,"○","○","○","○","○","○","○","○","○","○","○","○","○","○","○","○","○","○","○","○","○","○","○","○","○","○","○","○","○","○","○","○","○","○","○","○","○","○","○","○","○","○","○","○","○","○","○","○","○","○","○","○","○","○","○","○","○","○","○","○","○","○","○","○","○","○","○","○","○","○","○","○","○","○","○","○","○","○","○","○","○","○","○","○","○","○","○","○","○","○","○","○","○","○","○","○","○","","○","","○","","○","","○","","○","","○","","○","","○","","○","","○","","○","","○","","○","","○","","○","","○","","○","","○","○","○","○","○","○","○","○","○","○","○","○","○","○","○","○","○","○","○","○","○","○","○","○","○","○","○","○","○","○","○","○","○","○","○","○","○","○","○","○","○","○","○","○","○","○","○","○","○","○","○","○","○","○","○","○","○","○","○","○","○","○","○","○","○","○","○","○","○","○","○","○","○","○","○","○","○","○","○","○","○","○","○","○","○","○","○","○","○","○","○","○","○","○","○","○","○","○","○","○","○","○","○","○","○","○","○","○","○","○","○","○","○","○","○","○","○","○","○","○","○","○","○","○","○","○","○","○","○","○","○","○","○","○","○","○","○","○","○","○","○","○","○","○","○","○","○","○","○","○","○","○","○","○","○","○","○","○","○","○","○","○","○","○","○","○","○","○","○","○","○","○","×","○","○","○","○","○","○","○","○","○","○","×","○","○","○","○","○","○","○","○","○","○","○","○","○","○","○","○","×","○","○","○","○","○","○","○","○","○","○","○","○","○","○","×","○","○","○","○","○","○","○","○","○","○","○","○","○","×","○","○","○","○","○","○","○","○","○","○","○","○","○","○","○","○","×","○","○","○","○","○","○","○","○","○","○","○","○","○","○","×","○","○","○","○","○","○","○","○","○","○","○","○","○","○","○","○","×","○","○","○","○","○","○","○","○","○","○","○","○","○","○","×","○","○","○","○","○","○","○","○","○","○","○","○","○","○","○","○","×","○","○","○","○","○","○","○","○","○","○","○","○","○","○","○","○","×","○","○","○","○","○","○","○","○","○","○","○","○","○","○","○","○","×","○","○","○","○","○","○","○","○","○","○","○","○","○","○","×","○","○","○","○","○","○","○","○","○","○","○","○","○","○","○","○","×","○","○","○","○","○","○","○","○","○","○","○","○","○","○","○","○","○","×","○","○","○","○","○","×","○","○","○","○","○","○","×","○","○","○","○","○","○","○","○","○","○","○","○","○","○","○","○","×","○","○","○","○","○","○","○","○","○","○","○","○","○","○","○","○","○","○","○","○","×","○","○","○","○","○","○","○","○","×","○",null,"A",null,null,"【機　　能】","ネットワークスキャナの使い方を想定する\n",null,null,null,null,null,null,1,"0001",0,0,0,1,null,null,"Assumed how to use network scanner. \n"]
[5,null,null,"○","○","○","○","○","○","○","○","○","○","○","○","○","○","○","○","○","○","○","○","○","○","○","○","○","○","○","○","○","○","○","○","○","○","○","○","○","○","○","○","○","○","○","○","○","○","○","○","○","○","○","○","○","○","○","○","○","○","○","○","○","○","○","○","○","○","○","○","○","○","○","○","○","○","○","○","○","○","○","○","○","○","○","○","○","○","○","○","○","○","○","○","○","○","○","○","○","","○","","○","","○","","○","","○","","○","","○","","○","","○","","○","","○","","○","","○","","○","","○","","○","","○","","○","○","○","○","○","○","○","○","○","○","○","○","○","○","○","○","○","○","○","○","○","○","○","○","○","○","○","○","○","○","○","○","○","○","○","○","○","○","○","○","○","○","○","○","○","○","○","○","○","○","○","○","○","○","○","○","○","○","○","○","○","○","○","○","○","○","○","○","○","○","○","○","○","○","○","○","○","○","○","○","○","○","○","○","○","○","○","○","○","○","○","○","○","○","○","○","○","○","○","○","○","○","○","○","○","○","○","○","○","○","○","○","○","○","○","○","○","○","○","○","○","○","○","○","○","○","○","○","○","○","○","○","○","○","○","○","○","○","○","○","○","○","○","○","○","○","○","○","○","○","○","○","○","○","○","○","○","○","○","○","○","○","○","○","○","○","○","○","○","○","○","○","×","○","○","○","○","○","○","○","○","○","○","×","○","○","○","○","○","○","○","○","○","○","○","○","○","○","○","○","×","○","○","○","○","○","○","○","○","○","○","○","○","○","○","×","○","○","○","○","○","○","○","○","○","○","○","○","○","×","○","○","○","○","○","○","○","○","○","○","○","○","○","○","○","○","×","○","○","○","○","○","○","○","○","○","○","○","○","○","○","×","○","○","○","○","○","○","○","○","○","○","○","○","○","○","○","○","×","○","○","○","○","○","○","○","○","○","○","○","○","○","○","×","○","○","○","○","○","○","○","○","○","○","○","○","○","○","○","○","×","○","○","○","○","○","○","○","○","○","○","○","○","○","○","○","○","×","○","○","○","○","○","○","○","○","○","○","○","○","○","○","○","○","×","○","○","○","○","○","○","○","○","○","○","○","○","○","○","×","○","○","○","○","○","○","○","○","○","○","○","○","○","○","○","○","×","○","○","○","○","○","○","○","○","○","○","○","○","○","○","○","○","○","×","○","○","○","○","○","×","○","○","○","○","○","○","×","○","○","○","○","○","○","○","○","○","○","○","○","○","○","○","○","×","○","○","○","○","○","○","○","○","○","○","○","○","○","○","○","○","○","○","○","○","×","○","○","○","○","○","○","○","○","×","○",null,"A",null,null,"【参　　考】\n(評価対象外)","1. 制御FUMで想定するネットワークスキャナとは\n","現流機のコンセプトである「オフィスにて使用するネットワークスキャナ」を踏襲し以下の方針で検討する\n",null,null,null,null,null,1,"0001",0,0,0,1,null,null,"1. Network scanner expected using control FUM\n","Following are the points to be reviewed based on the network scanner used in the office which is a concept of the exsting machine.  \n"]
[6,null,null,"○","○","○","○","○","○","○","○","○","○","○","○","○","○","○","○","○","○","○","○","○","○","○","○","○","○","○","○","○","○","○","○","○","○","○","○","○","○","○","○","○","○","○","○","○","○","○","○","○","○","○","○","○","○","○","○","○","○","○","○","○","○","○","○","○","○","○","○","○","○","○","○","○","○","○","○","○","○","○","○","○","○","○","○","○","○","○","○","○","○","○","○","○","○","○","○","○","","○","","○","","○","","○","","○","","○","","○","","○","","○","","○","","○","","○","","○","","○","","○","","○","","○","","○","○","○","○","○","○","○","○","○","○","○","○","○","○","○","○","○","○","○","○","○","○","○","○","○","○","○","○","○","○","○","○","○","○","○","○","○","○","○","○","○","○","○","○","○","○","○","○","○","○","○","○","○","○","○","○","○","○","○","○","○","○","○","○","○","○","○","○","○","○","○","○","○","○","○","○","○","○","○","○","○","○","○","○","○","○","○","○","○","○","○","○","○","○","○","○","○","○","○","○","○","○","○","○","○","○","○","○","○","○","○","○","○","○","○","○","○","○","○","○","○","○","○","○","○","○","○","○","○","○","○","○","○","○","○","○","○","○","○","○","○","○","○","○","○","○","○","○","○","○","○","○","○","○","○","○","○","○","○","○","○","○","○","○","○","○","○","○","○","○","○","○","×","○","○","○","○","○","○","○","○","○","○","×","○","○","○","○","○","○","○","○","○","○","○","○","○","○","○","○","×","○","○","○","○","○","○","○","○","○","○","○","○","○","○","×","○","○","○","○","○","○","○","○","○","○","○","○","○","×","○","○","○","○","○","○","○","○","○","○","○","○","○","○","○","○","×","○","○","○","○","○","○","○","○","○","○","○","○","○","○","×","○","○","○","○","○","○","○","○","○","○","○","○","○","○","○","○","×","○","○","○","○","○","○","○","○","○","○","○","○","○","○","×","○","○","○","○","○","○","○","○","○","○","○","○","○","○","○","○","×","○","○","○","○","○","○","○","○","○","○","○","○","○","○","○","○","×","○","○","○","○","○","○","○","○","○","○","○","○","○","○","○","○","×","○","○","○","○","○","○","○","○","○","○","○","○","○","○","×","○","○","○","○","○","○","○","○","○","○","○","○","○","○","○","○","×","○","○","○","○","○","○","○","○","○","○","○","○","○","○","○","○","○","×","○","○","○","○","○","×","○","○","○","○","○","○","×","○","○","○","○","○","○","○","○","○","○","○","○","○","○","○","○","×","○","○","○","○","○","○","○","○","○","○","○","○","○","○","○","○","○","○","○","○","×","○","○","○","○","○","○","○","○","×","○",null,"A",null,null,null,null,"1) PCに読み取り画像を送るための機能をサポートする\n","→　PCアプリでの読み込み画像の編集、ファイリング作業、第三者への送信が利用目的と考える\n","ただ、MFPのスキャナは高速読み込みが特徴であるためファイリングが主と思われる\n",null,null,null,null,"","","","","",null,null,null,"1) Functional support in order to send scanned image \n     to PC. ","--> Objectives are editing scanned image using PC application, filing and transmission to the third party.","However, the characteristic of MFP scanner is high speed scan, so its main purpose may be filing. \n"]
[7,null,null,"×","×","×","×","×","×","×","×","×","×","×","×","×","×","×","×","×","×","×","×","×","×","×","×","×","×","×","×","×","×","×","×","×","×","×","×","×","×","×","×","×","×","×","×","×","×","×","×","×","×","×","×","×","×","×","×","×","×","×","×","×","×","×","×","×","×","×","×","×","×","×","×","×","×","×","×","×","×","×","×","×","×","×","×","×","×","×","×","×","×","×","×","×","×","×","×","×","","×","","×","","×","","×","","×","","×","","×","","×","","×","","×","","×","","×","","×","","×","","×","","×","","×","","×","×","×","×","×","×","×","×","×","×","×","×","×","×","×","×","×","×","×","×","×","×","×","×","×","×","×","×","×","×","×","×","×","×","×","×","×","×","×","×","×","×","×","×","×","×","×","×","×","×","×","×","×","×","×","×","×","×","×","×","×","×","×","×","×","×","×","×","×","×","×","×","×","×","×","×","×","×","×","×","×","×","×","×","×","×","×","×","×","×","×","×","×","×","×","×","×","×","×","×","×","×","×","×","×","×","×","×","×","×","×","×","×","×","×","×","×","×","×","×","×","×","×","×","×","×","×","×","×","×","×","×","×","×","×","×","×","×","×","×","×","×","×","×","×","×","×","×","×","×","×","×","×","×","×","×","×","×","×","×","×","×","×","×","×","×","×","×","×","×","×","×","×","×","×","×","×","×","×","×","×","×","×","×","×","×","×","×","×","×","×","×","×","×","×","×","×","×","×","×","×","×","×","×","×","×","×","×","×","×","×","×","×","×","×","×","×","×","×","×","×","×","×","×","×","×","×","×","×","×","×","×","×","×","×","×","×","×","×","×","×","×","×","×","×","×","×","×","×","×","×","×","×","×","×","×","×","×","×","×","×","×","×","×","×","×","×","×","×","×","×","×","×","×","×","×","×","×","×","×","×","×","×","×","×","×","×","×","×","×","×","×","×","×","×","×","×","×","×","×","×","×","×","×","×","×","×","×","×","×","×","×","×","×","×","×","×","×","×","×","×","×","×","×","×","×","×","×","×","×","×","×","×","×","×","×","×","×","×","×","×","×","×","×","×","×","×","×","×","×","×","×","×","×","×","×","×","×","×","×","×","×","×","×","×","×","×","×","×","×","×","×","×","×","×","×","×","×","×","×","×","×","×","×","×","×","×","×","×","×","×","×","×","×","×","×","×","×","×","×","×","×","×","×","×","×","×","×","×","×","×","×","×","×","×","×","×","×","×","×","×","×","×","×","×","×","×","×","×","×","×","×","×","×","×","×","×","×","×","×","×","×","×","×","×","×","×","×","×","×","×","×","×","×","×","×",null,"-","-","-",null,null,"2) 本体パネルで難しい操作はさせない","→　条件設定に本体パネルを使用すると操作性が悪く、表示/入力等の操作上の制約もある",null,null,null,null,null,"","","","","",null,null,null,"2) 本体パネルで難しい操作はさせない","→　条件設定に本体パネルを使用すると操作性が悪く、表示/入力等の操作上の制約もある"]
[8,null,null,"○","○","○","○","○","○","○","○","○","○","○","○","○","○","○","○","○","○","○","○","○","○","○","○","○","○","○","○","○","○","○","○","○","○","○","○","○","○","○","○","○","○","○","○","○","○","○","○","○","○","○","○","○","○","○","○","○","○","○","○","○","○","○","○","○","○","○","○","○","○","○","○","○","○","○","○","○","○","○","○","○","○","○","○","○","○","○","○","○","○","○","○","○","○","○","○","○","","○","","○","","○","","○","","○","","○","","○","","○","","○","","○","","○","","○","","○","","○","","○","","○","","○","","○","○","○","○","○","○","○","○","○","○","○","○","○","○","○","○","○","○","○","○","○","○","○","○","○","○","○","○","○","○","○","○","○","○","○","○","○","○","○","○","○","○","○","○","○","○","○","○","○","○","○","○","○","○","○","○","○","○","○","○","○","○","○","○","○","○","○","○","○","○","○","○","○","○","○","○","○","○","○","○","○","○","○","○","○","○","○","○","○","○","○","○","○","○","○","○","○","○","○","○","○","○","○","○","○","○","○","○","○","○","○","○","○","○","○","○","○","○","○","○","○","○","○","○","○","○","○","○","○","○","○","○","○","○","○","○","○","○","○","○","○","○","○","○","○","○","○","○","○","○","○","○","○","○","○","○","○","○","○","○","○","○","○","○","○","○","○","○","○","○","○","○","×","○","○","○","○","○","○","○","○","○","○","×","○","○","○","○","○","○","○","○","○","○","○","○","○","○","○","○","×","○","○","○","○","○","○","○","○","○","○","○","○","○","○","×","○","○","○","○","○","○","○","○","○","○","○","○","○","×","○","○","○","○","○","○","○","○","○","○","○","○","○","○","○","○","×","○","○","○","○","○","○","○","○","○","○","○","○","○","○","×","○","○","○","○","○","○","○","○","○","○","○","○","○","○","○","○","×","○","○","○","○","○","○","○","○","○","○","○","○","○","○","×","○","○","○","○","○","○","○","○","○","○","○","○","○","○","○","○","×","○","○","○","○","○","○","○","○","○","○","○","○","○","○","○","○","×","○","○","○","○","○","○","○","○","○","○","○","○","○","○","○","○","×","○","○","○","○","○","○","○","○","○","○","○","○","○","○","×","○","○","○","○","○","○","○","○","○","○","○","○","○","○","○","○","×","○","○","○","○","○","○","○","○","○","○","○","○","○","○","○","○","○","×","○","○","○","○","○","×","○","○","○","○","○","○","×","○","○","○","○","○","○","○","○","○","○","○","○","○","○","○","○","×","○","○","○","○","○","○","○","○","○","○","○","○","○","○","○","○","○","○","○","○","×","○","○","○","○","○","○","○","○","×","○",null,"A",null,null,null,null,"3) PC上からのリモートによる設定により操作上の制約を補う\n","→　複雑な設定はPC上で行い、設定を転送する\n",null,null,null,null,null,"","","","","",null,null,null,"3) Remote setting on PC shall make up for the operational restrictions \n","--> A complicated setting, shall be performed on PC    \n      and forwarded.  \n"]
[9,null,null,"○","○","○","○","○","○","○","○","○","○","○","○","○","○","○","○","○","○","○","○","○","○","○","○","○","○","○","○","○","○","○","○","○","○","○","○","○","○","○","○","○","○","○","○","○","○","○","○","○","○","○","○","○","○","○","○","○","○","○","○","○","○","○","○","○","○","○","○","○","○","○","○","○","○","○","○","○","○","○","○","○","○","○","○","○","○","○","○","○","○","○","○","○","○","○","○","○","","○","","○","","○","","○","","○","","○","","○","","○","","○","","○","","○","","○","","○","","○","","○","","○","","○","","○","○","○","○","○","○","○","○","○","○","○","○","○","○","○","○","○","○","○","○","○","○","○","○","○","○","○","○","○","○","○","○","○","○","○","○","○","○","○","○","○","○","○","○","○","○","○","○","○","○","○","○","○","○","○","○","○","○","○","○","○","○","○","○","○","○","○","○","○","○","○","○","○","○","○","○","○","○","○","○","○","○","○","○","○","○","○","○","○","○","○","○","○","○","○","○","○","○","○","○","○","○","○","○","○","○","○","○","○","○","○","○","○","○","○","○","○","○","○","○","○","○","○","○","○","○","○","○","○","○","○","○","○","○","○","○","○","○","○","○","○","○","○","○","○","○","○","○","○","○","○","○","○","○","○","○","○","○","○","○","○","○","○","○","○","○","○","○","○","○","○","○","×","○","○","○","○","○","○","○","○","○","○","×","○","○","○","○","○","○","○","○","○","○","○","○","○","○","○","○","×","○","○","○","○","○","○","○","○","○","○","○","○","○","○","×","○","○","○","○","○","○","○","○","○","○","○","○","○","×","○","○","○","○","○","○","○","○","○","○","○","○","○","○","○","○","×","○","○","○","○","○","○","○","○","○","○","○","○","○","○","×","○","○","○","○","○","○","○","○","○","○","○","○","○","○","○","○","×","○","○","○","○","○","○","○","○","○","○","○","○","○","○","×","○","○","○","○","○","○","○","○","○","○","○","○","○","○","○","○","×","○","○","○","○","○","○","○","○","○","○","○","○","○","○","○","○","×","○","○","○","○","○","○","○","○","○","○","○","○","○","○","○","○","×","○","○","○","○","○","○","○","○","○","○","○","○","○","○","×","○","○","○","○","○","○","○","○","○","○","○","○","○","○","○","○","×","○","○","○","○","○","○","○","○","○","○","○","○","○","○","○","○","○","×","○","○","○","○","○","×","○","○","○","○","○","○","×","○","○","○","○","○","○","○","○","○","○","○","○","○","○","○","○","×","○","○","○","○","○","○","○","○","○","○","○","○","○","○","○","○","○","○","○","○","×","○","○","○","○","○","○","○","○","×","○",null,"A",null,null,null,null,"4) 蓄積画像およびリモート設定は、ユーザーが簡単に扱えなければならない\n","→　PC汎用ソフト(ブラウザ、メーラ等)で取り扱えること\n",null,null,null,null,null,"","","","","",null,null,null,"4) Stored image or remote setting shall be accessible for a \n    user. \n","--> Can be handled using general-purpose PC software\n       including a browser or mailer. \n"]
[10,null,null,"○","○","○","○","○","○","○","○","○","○","○","○","○","○","○","○","○","○","○","○","○","○","○","○","○","○","○","○","○","○","○","○","○","○","○","○","○","○","○","○","○","○","○","○","○","○","○","○","○","○","○","○","○","○","○","○","○","○","○","○","○","○","○","○","○","○","○","○","○","○","○","○","○","○","○","○","○","○","○","○","○","○","○","○","○","○","○","○","○","○","○","○","○","○","○","○","○","","○","","○","","○","","○","","○","","○","","○","","○","","○","","○","","○","","○","","○","","○","","○","","○","","○","","○","○","○","○","○","○","○","○","○","○","○","○","○","○","○","○","○","○","○","○","○","○","○","○","○","○","○","○","○","○","○","○","○","○","○","○","○","○","○","○","○","○","○","○","○","○","○","○","○","○","○","○","○","○","○","○","○","○","○","○","○","○","○","○","○","○","○","○","○","○","○","○","○","○","○","○","○","○","○","○","○","○","○","○","○","○","○","○","○","○","○","○","○","○","○","○","○","○","○","○","○","○","○","○","○","○","○","○","○","○","○","○","○","○","○","○","○","○","○","○","○","○","○","○","○","○","○","○","○","○","○","○","○","○","○","○","○","○","○","○","○","○","○","○","○","○","○","○","○","○","○","○","○","○","○","○","○","○","○","○","○","○","○","○","○","○","○","○","○","○","○","○","×","○","○","○","○","○","○","○","○","○","○","×","○","○","○","○","○","○","○","○","○","○","○","○","○","○","○","○","×","○","○","○","○","○","○","○","○","○","○","○","○","○","○","×","○","○","○","○","○","○","○","○","○","○","○","○","○","×","○","○","○","○","○","○","○","○","○","○","○","○","○","○","○","○","×","○","○","○","○","○","○","○","○","○","○","○","○","○","○","×","○","○","○","○","○","○","○","○","○","○","○","○","○","○","○","○","×","○","○","○","○","○","○","○","○","○","○","○","○","○","○","×","○","○","○","○","○","○","○","○","○","○","○","○","○","○","○","○","×","○","○","○","○","○","○","○","○","○","○","○","○","○","○","○","○","×","○","○","○","○","○","○","○","○","○","○","○","○","○","○","○","○","×","○","○","○","○","○","○","○","○","○","○","○","○","○","○","×","○","○","○","○","○","○","○","○","○","○","○","○","○","○","○","○","×","○","○","○","○","○","○","○","○","○","○","○","○","○","○","○","○","○","×","○","○","○","○","○","×","○","○","○","○","○","○","×","○","○","○","○","○","○","○","○","○","○","○","○","○","○","○","○","×","○","○","○","○","○","○","○","○","○","○","○","○","○","○","○","○","○","○","○","○","×","○","○","○","○","○","○","○","○","×","○",null,"A",null,null,null,null,"5) 利用目的が異なる場合は、別のアプリにより実現すればよい\n","→　一つのアプリに複数の利用目的を持たせない\n(用途をハッキリさせた方がユーザーも分かり易い)\n",null,null,null,null,null,"","","","","",null,null,null,"5) In case that the objectives of use is different, such objective can be realized using another application.  \n","--> No plural purposes for one application. \n(Clear intended purpose for a user accessibility.)\n\n"]
[11,null,null,"×","×","×","×","×","×","×","×","×","×","×","×","×","×","×","×","×","×","×","×","×","×","×","×","×","×","×","×","×","×","×","×","×","×","×","×","×","×","×","×","×","×","×","×","×","×","×","×","×","×","×","×","×","×","×","×","×","×","×","×","×","×","×","×","×","×","×","×","×","×","×","×","×","×","×","×","×","×","×","×","×","×","×","×","×","×","×","×","×","×","×","×","×","×","×","×","×","","×","","×","","×","","×","","×","","×","","×","","×","","×","","×","","×","","×","","×","","×","","×","","×","","×","","×","×","×","×","×","×","×","×","×","×","×","×","×","×","×","×","×","×","×","×","×","×","×","×","×","×","×","×","×","×","×","×","×","×","×","×","×","×","×","×","×","×","×","×","×","×","×","×","×","×","×","×","×","×","×","×","×","×","×","×","×","×","×","×","×","×","×","×","×","×","×","×","×","×","×","×","×","×","×","×","×","×","×","×","×","×","×","×","×","×","×","×","×","×","×","×","×","×","×","×","×","×","×","×","×","×","×","×","×","×","×","×","×","×","×","×","×","×","×","×","×","×","×","×","×","×","×","×","×","×","×","×","×","×","×","×","×","×","×","×","×","×","×","×","×","×","×","×","×","×","×","×","×","×","×","×","×","×","×","×","×","×","×","×","×","×","×","×","×","×","×","×","×","×","×","×","×","×","×","×","×","×","×","×","×","×","×","×","×","×","×","×","×","×","×","×","×","×","×","×","×","×","×","×","×","×","×","×","×","×","×","×","×","×","×","×","×","×","×","×","×","×","×","×","×","×","×","×","×","×","×","×","×","×","×","×","×","×","×","×","×","×","×","×","×","×","×","×","×","×","×","×","×","×","×","×","×","×","×","×","×","×","×","×","×","×","×","×","×","×","×","×","×","×","×","×","×","×","×","×","×","×","×","×","×","×","×","×","×","×","×","×","×","×","×","×","×","×","×","×","×","×","×","×","×","×","×","×","×","×","×","×","×","×","×","×","×","×","×","×","×","×","×","×","×","×","×","×","×","×","×","×","×","×","×","×","×","×","×","×","×","×","×","×","×","×","×","×","×","×","×","×","×","×","×","×","×","×","×","×","×","×","×","×","×","×","×","×","×","×","×","×","×","×","×","×","×","×","×","×","×","×","×","×","×","×","×","×","×","×","×","×","×","×","×","×","×","×","×","×","×","×","×","×","×","×","×","×","×","×","×","×","×","×","×","×","×","×","×","×","×","×","×","×","×","×","×","×","×","×","×","×","×","×","×","×","×","×","×","×","×","×","×","×","×","×","×","×","×","×","×","×","×","×","×","×",null,"-","-","-",null,null,"6) ミノルタ標準仕様に準拠する (*1)","→　\"ネットワークアプリケーションFUM システム標準要求書\"で要求される機能を満たす (*1)",null,null,null,null,null,"","","","","",null,null,null,"6) ミノルタ標準仕様に準拠する (*1)","→　\"ネットワークアプリケーションFUM システム標準要求書\"で要求される機能を満たす (*1)"]
[12,null,null,"○","○","○","○","○","○","○","○","○","○","○","○","○","○","○","○","○","○","○","○","○","○","○","○","○","○","○","○","○","○","○","○","○","○","○","○","○","○","○","○","○","○","○","○","○","○","○","○","○","○","○","○","○","○","○","○","○","○","○","○","○","○","○","○","○","○","○","○","○","○","○","○","○","○","○","○","○","○","○","○","○","○","○","○","○","○","○","○","○","○","○","○","○","○","○","○","○","","○","","○","","○","","○","","○","","○","","○","","○","","○","","○","","○","","○","","○","","○","","○","","○","","○","","○","○","○","○","○","○","○","○","○","○","○","○","○","○","○","○","○","○","○","○","○","○","○","○","○","○","○","○","○","○","○","○","○","○","○","○","○","○","○","○","○","○","○","○","○","○","○","○","○","○","○","○","○","○","○","○","○","○","○","○","○","○","○","○","○","○","○","○","○","○","○","○","○","○","○","○","○","○","○","○","○","○","○","○","○","○","○","○","○","○","○","○","○","○","○","○","○","○","○","○","○","○","○","○","○","○","○","○","○","○","○","○","○","○","○","○","○","○","○","○","○","○","○","○","○","○","○","○","○","○","○","○","○","○","○","○","○","○","○","○","○","○","○","○","○","○","○","○","○","○","○","○","○","○","○","○","○","○","○","○","○","○","○","○","○","○","○","○","○","○","○","○","×","○","○","○","○","○","○","○","○","○","○","×","○","○","○","○","○","○","○","○","○","○","○","○","○","○","○","○","×","○","○","○","○","○","○","○","○","○","○","○","○","○","○","×","○","○","○","○","○","○","○","○","○","○","○","○","○","×","○","○","○","○","○","○","○","○","○","○","○","○","○","○","○","○","×","○","○","○","○","○","○","○","○","○","○","○","○","○","○","×","○","○","○","○","○","○","○","○","○","○","○","○","○","○","○","○","×","○","○","○","○","○","○","○","○","○","○","○","○","○","○","×","○","○","○","○","○","○","○","○","○","○","○","○","○","○","○","○","×","○","○","○","○","○","○","○","○","○","○","○","○","○","○","○","○","×","○","○","○","○","○","○","○","○","○","○","○","○","○","○","○","○","×","○","○","○","○","○","○","○","○","○","○","○","○","○","○","×","○","○","○","○","○","○","○","○","○","○","○","○","○","○","○","○","×","○","○","○","○","○","○","○","○","○","○","○","○","○","○","○","○","○","×","○","○","○","○","○","×","○","○","○","○","○","○","×","○","○","○","○","○","○","○","○","○","○","○","○","○","○","○","○","×","○","○","○","○","○","○","○","○","○","○","○","○","○","○","○","○","○","○","○","○","×","○","○","○","○","○","○","○","○","×","○",null,"A",null,null,null,"2. 考慮しておくべき項目","1) 今後の拡張性\n","想定外の使い方(新規アプリ)についても制御FUMとして考慮が必要である\n",null,null,null,null,null,"","","","","",null,null,"2. Items to be considered","1) Future expandability  ","With unexpected use (new application), it shall require to consider as a control FUM. \n"]
[13,null,null,"○","○","○","○","○","○","○","○","○","○","○","○","○","○","○","○","○","○","○","○","○","○","○","○","○","○","○","○","○","○","○","○","○","○","○","○","○","○","○","○","○","○","○","○","○","○","○","○","○","○","○","○","○","○","○","○","○","○","○","○","○","○","○","○","○","○","○","○","○","○","○","○","○","○","○","○","○","○","○","○","○","○","○","○","○","○","○","○","○","○","○","○","○","○","○","○","○","","○","","○","","○","","○","","○","","○","","○","","○","","○","","○","","○","","○","","○","","○","","○","","○","","○","","○","○","○","○","○","○","○","○","○","○","○","○","○","○","○","○","○","○","○","○","○","○","○","○","○","○","○","○","○","○","○","○","○","○","○","○","○","○","○","○","○","○","○","○","○","○","○","○","○","○","○","○","○","○","○","○","○","○","○","○","○","○","○","○","○","○","○","○","○","○","○","○","○","○","○","○","○","○","○","○","○","○","○","○","○","○","○","○","○","○","○","○","○","○","○","○","○","○","○","○","○","○","○","○","○","○","○","○","○","○","○","○","○","○","○","○","○","○","○","○","○","○","○","○","○","○","○","○","○","○","○","○","○","○","○","○","○","○","○","○","○","○","○","○","○","○","○","○","○","○","○","○","○","○","○","○","○","○","○","○","○","○","○","○","○","○","○","○","○","○","○","○","×","○","○","○","○","○","○","○","○","○","○","×","○","○","○","○","○","○","○","○","○","○","○","○","○","○","○","○","×","○","○","○","○","○","○","○","○","○","○","○","○","○","○","×","○","○","○","○","○","○","○","○","○","○","○","○","○","×","○","○","○","○","○","○","○","○","○","○","○","○","○","○","○","○","×","○","○","○","○","○","○","○","○","○","○","○","○","○","○","×","○","○","○","○","○","○","○","○","○","○","○","○","○","○","○","○","×","○","○","○","○","○","○","○","○","○","○","○","○","○","○","×","○","○","○","○","○","○","○","○","○","○","○","○","○","○","○","○","×","○","○","○","○","○","○","○","○","○","○","○","○","○","○","○","○","×","○","○","○","○","○","○","○","○","○","○","○","○","○","○","○","○","×","○","○","○","○","○","○","○","○","○","○","○","○","○","○","×","○","○","○","○","○","○","○","○","○","○","○","○","○","○","○","○","×","○","○","○","○","○","○","○","○","○","○","○","○","○","○","○","○","○","×","○","○","○","○","○","×","○","○","○","○","○","○","×","○","○","○","○","○","○","○","○","○","○","○","○","○","○","○","○","×","○","○","○","○","○","○","○","○","○","○","○","○","○","○","○","○","○","○","○","○","×","○","○","○","○","○","○","○","○","×","○",null,"A",null,null,null,null,null,"制御FUMとして以下の2点をサポートしておけば、スキャナを利用した新規機能拡張は可能であると考える\n",null,null,null,null,null,"","","","","",null,null,null,null,"New function enhancement using scanner will be available, if the two points as described below are supported as control FUM. \n"]
[14,null,null,"○","○","○","○","○","○","○","○","○","○","○","○","○","○","○","○","○","○","○","○","○","○","○","○","○","○","○","○","○","○","○","○","○","○","○","○","○","○","○","○","○","○","○","○","○","○","○","○","○","○","○","○","○","○","○","○","○","○","○","○","○","○","○","○","○","○","○","○","○","○","○","○","○","○","○","○","○","○","○","○","○","○","○","○","○","○","○","○","○","○","○","○","○","○","○","○","○","","○","","○","","○","","○","","○","","○","","○","","○","","○","","○","","○","","○","","○","","○","","○","","○","","○","","○","○","○","○","○","○","○","○","○","○","○","○","○","○","○","○","○","○","○","○","○","○","○","○","○","○","○","○","○","○","○","○","○","○","○","○","○","○","○","○","○","○","○","○","○","○","○","○","○","○","○","○","○","○","○","○","○","○","○","○","○","○","○","○","○","○","○","○","○","○","○","○","○","○","○","○","○","○","○","○","○","○","○","○","○","○","○","○","○","○","○","○","○","○","○","○","○","○","○","○","○","○","○","○","○","○","○","○","○","○","○","○","○","○","○","○","○","○","○","○","○","○","○","○","○","○","○","○","○","○","○","○","○","○","○","○","○","○","○","○","○","○","○","○","○","○","○","○","○","○","○","○","○","○","○","○","○","○","○","○","○","○","○","○","○","○","○","○","○","○","○","○","×","○","○","○","○","○","○","○","○","○","○","×","○","○","○","○","○","○","○","○","○","○","○","○","○","○","○","○","×","○","○","○","○","○","○","○","○","○","○","○","○","○","○","×","○","○","○","○","○","○","○","○","○","○","○","○","○","×","○","○","○","○","○","○","○","○","○","○","○","○","○","○","○","○","×","○","○","○","○","○","○","○","○","○","○","○","○","○","○","×","○","○","○","○","○","○","○","○","○","○","○","○","○","○","○","○","×","○","○","○","○","○","○","○","○","○","○","○","○","○","○","×","○","○","○","○","○","○","○","○","○","○","○","○","○","○","○","○","×","○","○","○","○","○","○","○","○","○","○","○","○","○","○","○","○","×","○","○","○","○","○","○","○","○","○","○","○","○","○","○","○","○","×","○","○","○","○","○","○","○","○","○","○","○","○","○","○","×","○","○","○","○","○","○","○","○","○","○","○","○","○","○","○","○","×","○","○","○","○","○","○","○","○","○","○","○","○","○","○","○","○","○","×","○","○","○","○","○","×","○","○","○","○","○","○","×","○","○","○","○","○","○","○","○","○","○","○","○","○","○","○","○","×","○","○","○","○","○","○","○","○","○","○","○","○","○","○","○","○","○","○","○","○","×","○","○","○","○","○","○","○","○","×","○",null,"A",null,null,null,null,null,"(1) 読み込み画像データをHDDに格納する機能に対する対応\n",null,null,null,null,null,"","","","","",null,null,null,null,"(1) Functional support for scanned image data stored on HDD \n"]
[15,null,null,"○","○","○","○","○","○","○","○","○","○","○","○","○","○","○","○","○","○","○","○","○","○","○","○","○","○","○","○","○","○","○","○","○","○","○","○","○","○","○","○","○","○","○","○","○","○","○","○","○","○","○","○","○","○","○","○","○","○","○","○","○","○","○","○","○","○","○","○","○","○","○","○","○","○","○","○","○","○","○","○","○","○","○","○","○","○","○","○","○","○","○","○","○","○","○","○","○","","○","","○","","○","","○","","○","","○","","○","","○","","○","","○","","○","","○","","○","","○","","○","","○","","○","","○","○","○","○","○","○","○","○","○","○","○","○","○","○","○","○","○","○","○","○","○","○","○","○","○","○","○","○","○","○","○","○","○","○","○","○","○","○","○","○","○","○","○","○","○","○","○","○","○","○","○","○","○","○","○","○","○","○","○","○","○","○","○","○","○","○","○","○","○","○","○","○","○","○","○","○","○","○","○","○","○","○","○","○","○","○","○","○","○","○","○","○","○","○","○","○","○","○","○","○","○","○","○","○","○","○","○","○","○","○","○","○","○","○","○","○","○","○","○","○","○","○","○","○","○","○","○","○","○","○","○","○","○","○","○","○","○","○","○","○","○","○","○","○","○","○","○","○","○","○","○","○","○","○","○","○","○","○","○","○","○","○","○","○","○","○","○","○","○","○","○","○","×","○","○","○","○","○","○","○","○","○","○","×","○","○","○","○","○","○","○","○","○","○","○","○","○","○","○","○","×","○","○","○","○","○","○","○","○","○","○","○","○","○","○","×","○","○","○","○","○","○","○","○","○","○","○","○","○","×","○","○","○","○","○","○","○","○","○","○","○","○","○","○","○","○","×","○","○","○","○","○","○","○","○","○","○","○","○","○","○","×","○","○","○","○","○","○","○","○","○","○","○","○","○","○","○","○","×","○","○","○","○","○","○","○","○","○","○","○","○","○","○","×","○","○","○","○","○","○","○","○","○","○","○","○","○","○","○","○","×","○","○","○","○","○","○","○","○","○","○","○","○","○","○","○","○","×","○","○","○","○","○","○","○","○","○","○","○","○","○","○","○","○","×","○","○","○","○","○","○","○","○","○","○","○","○","○","○","×","○","○","○","○","○","○","○","○","○","○","○","○","○","○","○","○","×","○","○","○","○","○","○","○","○","○","○","○","○","○","○","○","○","○","×","○","○","○","○","○","×","○","○","○","○","○","○","×","○","○","○","○","○","○","○","○","○","○","○","○","○","○","○","○","×","○","○","○","○","○","○","○","○","○","○","○","○","○","○","○","○","○","○","○","○","×","○","○","○","○","○","○","○","○","×","○",null,"A",null,null,null,null,null,"(2) 本体パネルI/FのAPI化",null,null,null,null,null,"","","","","",null,null,null,null,"(2) To be operation panel interface programmable "]
[16,null,null,"○","○","○","○","○","○","○","○","○","○","○","○","○","○","○","○","○","○","○","○","○","○","○","○","○","○","○","○","○","○","○","○","○","○","○","○","○","○","○","○","○","○","○","○","○","○","○","○","○","○","○","○","○","○","○","○","○","○","○","○","○","○","○","○","○","○","○","○","○","○","○","○","○","○","○","○","○","○","○","○","○","○","○","○","○","○","○","○","○","○","○","○","○","○","○","○","○","","○","","○","","○","","○","","○","","○","","○","","○","","○","","○","","○","","○","","○","","○","","○","","○","","○","","○","○","○","○","○","○","○","○","○","○","○","○","○","○","○","○","○","○","○","○","○","○","○","○","○","○","○","○","○","○","○","○","○","○","○","○","○","○","○","○","○","○","○","○","○","○","○","○","○","○","○","○","○","○","○","○","○","○","○","○","○","○","○","○","○","○","○","○","○","○","○","○","○","○","○","○","○","○","○","○","○","○","○","○","○","○","○","○","○","○","○","○","○","○","○","○","○","○","○","○","○","○","○","○","○","○","○","○","○","○","○","○","○","○","○","○","○","○","○","○","○","○","○","○","○","○","○","○","○","○","○","○","○","○","○","○","○","○","○","○","○","○","○","○","○","○","○","○","○","○","○","○","○","○","○","○","○","○","○","○","○","○","○","○","○","○","○","○","○","○","○","○","×","○","○","○","○","○","○","○","○","○","○","×","○","○","○","○","○","○","○","○","○","○","○","○","○","○","○","○","×","○","○","○","○","○","○","○","○","○","○","○","○","○","○","×","○","○","○","○","○","○","○","○","○","○","○","○","○","×","○","○","○","○","○","○","○","○","○","○","○","○","○","○","○","○","×","○","○","○","○","○","○","○","○","○","○","○","○","○","○","×","○","○","○","○","○","○","○","○","○","○","○","○","○","○","○","○","×","○","○","○","○","○","○","○","○","○","○","○","○","○","○","×","○","○","○","○","○","○","○","○","○","○","○","○","○","○","○","○","×","○","○","○","○","○","○","○","○","○","○","○","○","○","○","○","○","×","○","○","○","○","○","○","○","○","○","○","○","○","○","○","○","○","×","○","○","○","○","○","○","○","○","○","○","○","○","○","○","×","○","○","○","○","○","○","○","○","○","○","○","○","○","○","○","○","×","○","○","○","○","○","○","○","○","○","○","○","○","○","○","○","○","○","×","○","○","○","○","○","×","○","○","○","○","○","○","×","○","○","○","○","○","○","○","○","○","○","○","○","○","○","○","○","×","○","○","○","○","○","○","○","○","○","○","○","○","○","○","○","○","○","○","○","○","×","○","○","○","○","○","○","○","○","×","○",null,"A",null,null,null,null,"2) メール配信時のサーバー&ネットワーク負荷","読み込み原稿のカラー化による添付データの増大が問題となるはずである\n",null,null,null,null,null,"","","","","",null,null,null,"2) Server and network loading while mail transmission","Growing data size caused by colorized scanned originals to be attached to e-mail may be a problem   \n"]
[17,null,null,"○","○","○","○","○","○","○","○","○","○","○","○","○","○","○","○","○","○","○","○","○","○","○","○","○","○","○","○","○","○","○","○","○","○","○","○","○","○","○","○","○","○","○","○","○","○","○","○","○","○","○","○","○","○","○","○","○","○","○","○","○","○","○","○","○","○","○","○","○","○","○","○","○","○","○","○","○","○","○","○","○","○","○","○","○","○","○","○","○","○","○","○","○","○","○","○","○","","○","","○","","○","","○","","○","","○","","○","","○","","○","","○","","○","","○","","○","","○","","○","","○","","○","","○","○","○","○","○","○","○","○","○","○","○","○","○","○","○","○","○","○","○","○","○","○","○","○","○","○","○","○","○","○","○","○","○","○","○","○","○","○","○","○","○","○","○","○","○","○","○","○","○","○","○","○","○","○","○","○","○","○","○","○","○","○","○","○","○","○","○","○","○","○","○","○","○","○","○","○","○","○","○","○","○","○","○","○","○","○","○","○","○","○","○","○","○","○","○","○","○","○","○","○","○","○","○","○","○","○","○","○","○","○","○","○","○","○","○","○","○","○","○","○","○","○","○","○","○","○","○","○","○","○","○","○","○","○","○","○","○","○","○","○","○","○","○","○","○","○","○","○","○","○","○","○","○","○","○","○","○","○","○","○","○","○","○","○","○","○","○","○","○","○","○","○","×","○","○","○","○","○","○","○","○","○","○","×","○","○","○","○","○","○","○","○","○","○","○","○","○","○","○","○","×","○","○","○","○","○","○","○","○","○","○","○","○","○","○","×","○","○","○","○","○","○","○","○","○","○","○","○","○","×","○","○","○","○","○","○","○","○","○","○","○","○","○","○","○","○","×","○","○","○","○","○","○","○","○","○","○","○","○","○","○","×","○","○","○","○","○","○","○","○","○","○","○","○","○","○","○","○","×","○","○","○","○","○","○","○","○","○","○","○","○","○","○","×","○","○","○","○","○","○","○","○","○","○","○","○","○","○","○","○","×","○","○","○","○","○","○","○","○","○","○","○","○","○","○","○","○","×","○","○","○","○","○","○","○","○","○","○","○","○","○","○","○","○","×","○","○","○","○","○","○","○","○","○","○","○","○","○","○","×","○","○","○","○","○","○","○","○","○","○","○","○","○","○","○","○","×","○","○","○","○","○","○","○","○","○","○","○","○","○","○","○","○","○","×","○","○","○","○","○","×","○","○","○","○","○","○","×","○","○","○","○","○","○","○","○","○","○","○","○","○","○","○","○","×","○","○","○","○","○","○","○","○","○","○","○","○","○","○","○","○","○","○","○","○","×","○","○","○","○","○","○","○","○","×","○",null,"A",null,null,null,null,null,"配信方法の自動切り替え(読み込み文書のサイズによりメール以外の配信方法に自動的に切り替える)を行う必要がある\n",null,null,null,null,null,"","","","","",null,null,null,null,"Required to switch a transmission mode automatically. \n(Required to switch to a non E-mail transmission method automatically depending on a document size to be scanned.)"]
[18,null,null,"○","○","○","○","○","○","○","○","○","○","○","○","○","○","○","○","○","○","○","○","○","○","○","○","○","○","○","○","○","○","○","○","○","○","○","○","○","○","○","○","○","○","○","○","○","○","○","○","○","○","○","○","○","○","○","○","○","○","○","○","○","○","○","○","○","○","○","○","○","○","○","○","○","○","○","○","○","○","○","○","○","○","○","○","○","○","○","○","○","○","○","○","○","○","○","○","○","","○","","○","","○","","○","","○","","○","","○","","○","","○","","○","","○","","○","","○","","○","","○","","○","","○","","○","○","○","○","○","○","○","○","○","○","○","○","○","○","○","○","○","○","○","○","○","○","○","○","○","○","○","○","○","○","○","○","○","○","○","○","○","○","○","○","○","○","○","○","○","○","○","○","○","○","○","○","○","○","○","○","○","○","○","○","○","○","○","○","○","○","○","○","○","○","○","○","○","○","○","○","○","○","○","○","○","○","○","○","○","○","○","○","○","○","○","○","○","○","○","○","○","○","○","○","○","○","○","○","○","○","○","○","○","○","○","○","○","○","○","○","○","○","○","○","○","○","○","○","○","○","○","○","○","○","○","○","○","○","○","○","○","○","○","○","○","○","○","○","○","○","○","○","○","○","○","○","○","○","○","○","○","○","○","○","○","○","○","○","○","○","○","○","○","○","○","○","×","○","○","○","○","○","○","○","○","○","○","×","○","○","○","○","○","○","○","○","○","○","○","○","○","○","○","○","×","○","○","○","○","○","○","○","○","○","○","○","○","○","○","×","○","○","○","○","○","○","○","○","○","○","○","○","○","×","○","○","○","○","○","○","○","○","○","○","○","○","○","○","○","○","×","○","○","○","○","○","○","○","○","○","○","○","○","○","○","×","○","○","○","○","○","○","○","○","○","○","○","○","○","○","○","○","×","○","○","○","○","○","○","○","○","○","○","○","○","○","○","×","○","○","○","○","○","○","○","○","○","○","○","○","○","○","○","○","×","○","○","○","○","○","○","○","○","○","○","○","○","○","○","○","○","×","○","○","○","○","○","○","○","○","○","○","○","○","○","○","○","○","×","○","○","○","○","○","○","○","○","○","○","○","○","○","○","×","○","○","○","○","○","○","○","○","○","○","○","○","○","○","○","○","×","○","○","○","○","○","○","○","○","○","○","○","○","○","○","○","○","○","×","○","○","○","○","○","×","○","○","○","○","○","○","×","○","○","○","○","○","○","○","○","○","○","○","○","○","○","○","○","×","○","○","○","○","○","○","○","○","○","○","○","○","○","○","○","○","○","○","○","○","×","○","○","○","○","○","○","○","○","×","○",null,"A",null,null,"【メ　　モ】\n(評価対象外)",null,null,null,null,null,null,null,1,"0001",0,0,0,1]
[19,null,null,"×","－","－","－","－","－","－","－","－","－","－","－","－","－","－","－","－","－","－","－","－","－","－","－","－","－","－","－","－","－","－","－","－","－","－","－","－","－","－","－","－","－","－","－","－","－","－","－","－","－","－","－","－","－","－","－","－","－","－","－","－","－","－","－","－","－","－","－","－","－","－","－","－","－","－","－","－","－","－","－","－","－","－","－","－","－","－","－","－","－","－","－","－","－","－","－","－","","－","","－","","－","","－","","－","","－","","－","","－","","－","","－","","－","","－","","－","","－","","－","","－","","－","","－","－","－","－","－","－","－","－","－","－","－","－","－","－","－","－","－","－","－","－","－","－","－","－","－","－","－","－","－","－","－","－","－","－","－","－","－","－","－","－","－","－","－","－","－","－","－","－","－","－","－","－","－","－","－","－","－","－","－","－","－","－","－","－","－","－","－","－","－","－","－","－","－","－","－","－","－","－","－","－","－","－","－","－","－","－","－","－","－","－","－","－","－","－","－","－","－","－","－","－","－","－","－","－","－","－","－","－","－","－","－","－","－","－","－","－","－","－","－","－","－","－","－","－","－","－","－","－","－","－","－","－","－","－","－","－","－","－","－","－","－","－","－","－","－","－","－","－","－","－","－","－","－","－","－","－","－","－","－","－","－","－","－","－","－","－","－","－","－","－","－","－","－","－","－","－","－","－","－","－","－","－","－","－","－","－","－","－","－","－","－","－","－","－","－","－","－","－","－","－","－","－","－","－","－","－","－","－","－","－","－","－","－","－","－","－","－","－","－","－","－","－","－","－","－","－","－","－","－","－","－","－","－","－","－","－","－","－","－","－","－","－","－","－","－","－","－","－","－","－","－","－","－","－","－","－","－","－","－","－","－","－","－","－","－","－","－","－","－","－","－","－","－","－","－","－","－","－","－","－","－","－","－","－","－","－","－","－","－","－","－","－","－","－","－","－","－","－","－","－","－","－","－","－","－","－","－","－","－","－","－","－","－","－","－","－","－","－","－","－","－","－","－","－","－","－","－","－","－","－","－","－","－","－","－","－","－","－","－","－","－","－","－","－","－","－","－","－","－","－","－","－","－","－","－","－","－","－","－","－","－","－","－","－","－","－","－","－","－","－","－","－","－","－","－","－","－","－","－","－","－","－","－","－","－","－","－","－","－","－","－","－","－","－","－","－","－","－","－","－","－","－","－","－","－","－","－","－","－","－","－","－","－","－","－","－","－","－","－","－","－","－","－","－","－","－","－","－","－","－","－","－","－","－","－","－","－","－","－","－","－","－","－","－","－","－","－","－","－","－","－","－","－","－","－","－",null,"-","-","-","【履　　歴】\n(評価対象外)","2003/09/03 初版　松田",null,null,null,null,null,null,1,"0001",0,0,0,1,null,null,"Initial edition prepared by Matsuda on September 3, 2003",null,null,null,null,null,null,null,null,null,null,null,null,null,"○"]
["19-2",null,null,"×","－","－","－","－","－","－","－","－","－","－","－","－","－","－","－","－","－","－","－","－","－","－","－","－","－","－","－","－","－","－","－","－","－","－","－","－","－","－","－","－","－","－","－","－","－","－","－","－","－","－","－","－","－","－","－","－","－","－","－","－","－","－","－","－","－","－","－","－","－","－","－","－","－","－","－","－","－","－","－","－","－","－","－","－","－","－","－","－","－","－","－","－","－","－","－","－","","－","","－","","－","","－","","－","","－","","－","","－","","－","","－","","－","","－","","－","","－","","－","","－","","－","","－","－","－","－","－","－","－","－","－","－","－","－","－","－","－","－","－","－","－","－","－","－","－","－","－","－","－","－","－","－","－","－","－","－","－","－","－","－","－","－","－","－","－","－","－","－","－","－","－","－","－","－","－","－","－","－","－","－","－","－","－","－","－","－","－","－","－","－","－","－","－","－","－","－","－","－","－","－","－","－","－","－","－","－","－","－","－","－","－","－","－","－","－","－","－","－","－","－","－","－","－","－","－","－","－","－","－","－","－","－","－","－","－","－","－","－","－","－","－","－","－","－","－","－","－","－","－","－","－","－","－","－","－","－","－","－","－","－","－","－","－","－","－","－","－","－","－","－","－","－","－","－","－","－","－","－","－","－","－","－","－","－","－","－","－","－","－","－","－","－","－","－","－","－","－","－","－","－","－","－","－","－","－","－","－","－","－","－","－","－","－","－","－","－","－","－","－","－","－","－","－","－","－","－","－","－","－","－","－","－","－","－","－","－","－","－","－","－","－","－","－","－","－","－","－","－","－","－","－","－","－","－","－","－","－","－","－","－","－","－","－","－","－","－","－","－","－","－","－","－","－","－","－","－","－","－","－","－","－","－","－","－","－","－","－","－","－","－","－","－","－","－","－","－","－","－","－","－","－","－","－","－","－","－","－","－","－","－","－","－","－","－","－","－","－","－","－","－","－","－","－","－","－","－","－","－","－","－","－","－","－","－","－","－","－","－","－","－","－","－","－","－","－","－","－","－","－","－","－","－","－","－","－","－","－","－","－","－","－","－","－","－","－","－","－","－","－","－","－","－","－","－","－","－","－","－","－","－","－","－","－","－","－","－","－","－","－","－","－","－","－","－","－","－","－","－","－","－","－","－","－","－","－","－","－","－","－","－","－","－","－","－","－","－","－","－","－","－","－","－","－","－","－","－","－","－","－","－","－","－","－","－","－","－","－","－","－","－","－","－","－","－","－","－","－","－","－","－","－","－","－","－","－","－","－","－","－","－","－","－","－","－","－","－","－","－","－","－","－","－","－","－","－","－","－","－",null,"-","-","-",null,"2003/10/31 03（D)版　柴田",null,null,null,null,null,null,null,"","","","","",null,null,"03 rd (D) edition prepared by Shibata on October 31, 2003\n",null,null,null,null,null,null,null,null,null,null,null,null,null,"○"]
["19-3",null,null,"×","－","－","－","－","－","－","－","－","－","－","－","－","－","－","－","－","－","－","－","－","－","－","－","－","－","－","－","－","－","－","－","－","－","－","－","－","－","－","－","－","－","－","－","－","－","－","－","－","－","－","－","－","－","－","－","－","－","－","－","－","－","－","－","－","－","－","－","－","－","－","－","－","－","－","－","－","－","－","－","－","－","－","－","－","－","－","－","－","－","－","－","－","－","－","－","－","","－","","－","","－","","－","","－","","－","","－","","－","","－","","－","","－","","－","","－","","－","","－","","－","","－","","－","－","－","－","－","－","－","－","－","－","－","－","－","－","－","－","－","－","－","－","－","－","－","－","－","－","－","－","－","－","－","－","－","－","－","－","－","－","－","－","－","－","－","－","－","－","－","－","－","－","－","－","－","－","－","－","－","－","－","－","－","－","－","－","－","－","－","－","－","－","－","－","－","－","－","－","－","－","－","－","－","－","－","－","－","－","－","－","－","－","－","－","－","－","－","－","－","－","－","－","－","－","－","－","－","－","－","－","－","－","－","－","－","－","－","－","－","－","－","－","－","－","－","－","－","－","－","－","－","－","－","－","－","－","－","－","－","－","－","－","－","－","－","－","－","－","－","－","－","－","－","－","－","－","－","－","－","－","－","－","－","－","－","－","－","－","－","－","－","－","－","－","－","－","－","－","－","－","－","－","－","－","－","－","－","－","－","－","－","－","－","－","－","－","－","－","－","－","－","－","－","－","－","－","－","－","－","－","－","－","－","－","－","－","－","－","－","－","－","－","－","－","－","－","－","－","－","－","－","－","－","－","－","－","－","－","－","－","－","－","－","－","－","－","－","－","－","－","－","－","－","－","－","－","－","－","－","－","－","－","－","－","－","－","－","－","－","－","－","－","－","－","－","－","－","－","－","－","－","－","－","－","－","－","－","－","－","－","－","－","－","－","－","－","－","－","－","－","－","－","－","－","－","－","－","－","－","－","－","－","－","－","－","－","－","－","－","－","－","－","－","－","－","－","－","－","－","－","－","－","－","－","－","－","－","－","－","－","－","－","－","－","－","－","－","－","－","－","－","－","－","－","－","－","－","－","－","－","－","－","－","－","－","－","－","－","－","－","－","－","－","－","－","－","－","－","－","－","－","－","－","－","－","－","－","－","－","－","－","－","－","－","－","－","－","－","－","－","－","－","－","－","－","－","－","－","－","－","－","－","－","－","－","－","－","－","－","－","－","－","－","－","－","－","－","－","－","－","－","－","－","－","－","－","－","－","－","－","－","－","－","－","－","－","－","－","－","－","－","－","－","－","－","－","－","－",null,"-","-","-",null,"2004/01/07 修正　松田","統合仕様書ではないため(*1)の記述を削除",null,null,null,null,null,null,"","","","","",null,null,"Revised by Matsuda on January 7, 2004","Deleted a description of (*1) since it is not included in Integrated Specification. ",null,null,null,null,null,null,null,null,null,null,null,null,"○"]
[20,null,null,"×","○","○","○","○","○","○","○","○","○","○","○","○","○","○","○","○","○","○","○","○","○","○","○","○","○","○","○","○","○","○","○","○","○","○","○","○","○","○","○","○","○","○","○","○","○","○","○","○","○","○","○","○","○","○","○","○","○","○","○","○","○","○","○","○","○","○","○","○","○","○","○","○","○","○","○","○","○","○","○","○","○","○","○","○","○","○","○","○","○","○","○","○","○","○","○","○","","○","","○","","○","","○","","○","","○","","○","","○","","○","","○","","○","","○","","○","","○","","○","","○","","○","","○","○","○","○","○","○","○","○","○","○","○","○","○","○","○","○","○","○","○","○","○","○","○","○","○","○","○","○","○","○","○","○","○","○","○","○","○","○","○","○","○","○","○","○","○","○","○","○","○","○","○","○","○","○","○","○","○","○","○","○","○","○","○","○","○","○","○","○","○","○","○","○","○","○","○","○","○","○","○","○","○","○","○","○","○","○","○","○","○","○","○","○","○","○","○","○","○","○","○","○","○","○","○","○","○","○","○","○","○","○","○","○","○","○","○","○","○","○","○","○","○","○","○","○","○","○","○","○","○","○","○","○","○","○","○","○","○","○","○","○","○","○","○","○","○","○","○","○","○","○","○","○","○","○","○","○","○","○","○","○","○","○","○","○","○","○","○","○","○","○","○","○","×","○","○","○","○","○","○","○","○","○","○","×","○","○","○","○","○","○","○","○","○","○","○","○","○","○","○","○","×","○","○","○","○","○","○","○","○","○","○","○","○","○","○","×","○","○","○","○","○","○","○","○","○","○","○","○","○","×","○","○","○","○","○","○","○","○","○","○","○","○","○","○","○","○","×","○","○","○","○","○","○","○","○","○","○","○","○","○","○","×","○","○","○","○","○","○","○","○","○","○","○","○","○","○","○","○","×","○","○","○","○","○","○","○","○","○","○","○","○","○","○","×","○","○","○","○","○","○","○","○","○","○","○","○","○","○","○","○","×","○","○","○","○","○","○","○","○","○","○","○","○","○","○","○","○","×","○","○","○","○","○","○","○","○","○","○","○","○","○","○","○","○","×","○","○","○","○","○","○","○","○","○","○","○","○","○","○","×","○","○","○","○","○","○","○","○","○","○","○","○","○","○","○","○","×","○","○","○","○","○","○","○","○","○","○","○","○","○","○","○","○","○","×","○","○","○","○","○","×","○","○","○","○","○","○","×","○","○","○","○","○","○","○","○","○","○","○","○","○","○","○","○","×","○","○","○","○","○","○","○","○","○","○","○","○","○","○","○","○","○","○","○","○","×","○","○","○","○","○","○","○","○","×","○",null,"-","-","-",null,null,null,null,null,null,null,null,null,"","","","","",null,null,null,null,null,null,null,null,null,null,null,null,null,null,null,null,"○"]
[21,null,"ユーザーに提供する機能一覧","○","○","○","○","○","○","○","○","○","○","○","○","○","○","○","○","○","○","○","○","○","○","○","○","○","○","○","○","○","○","○","○","○","○","○","○","○","○","○","○","○","○","○","○","○","○","○","○","○","○","○","○","○","○","○","○","○","○","○","○","○","○","○","○","○","○","○","○","○","○","○","○","○","○","○","○","○","○","○","○","○","○","○","○","○","○","○","○","○","○","○","○","○","○","○","○","○","","○","","○","","○","","○","","○","","○","","○","","○","","○","","○","","○","","○","","○","","○","","○","","○","","○","","○","○","○","○","○","○","○","○","○","○","○","○","○","○","○","○","○","○","○","○","○","○","○","○","○","○","○","○","○","○","○","○","○","○","○","○","○","○","○","○","○","○","○","○","○","○","○","○","○","○","○","○","○","○","○","○","○","○","○","○","○","○","○","○","○","○","○","○","○","○","○","○","○","○","○","○","○","○","○","○","○","○","○","○","○","○","○","○","○","○","○","○","○","○","○","○","○","○","○","○","○","○","○","○","○","○","○","○","○","○","○","○","○","○","○","○","○","○","○","○","○","○","○","○","○","○","○","○","○","○","○","○","○","○","○","○","○","○","○","○","○","○","○","○","○","○","○","○","○","○","○","○","○","○","○","○","○","○","○","○","○","○","○","○","○","○","○","○","○","○","○","○","×","○","○","○","○","○","○","○","○","○","○","×","○","○","○","○","○","○","○","○","○","○","○","○","○","○","○","○","×","○","○","○","○","○","○","○","○","○","○","○","○","○","○","×","○","○","○","○","○","○","○","○","○","○","○","○","○","×","○","○","○","○","○","○","○","○","○","○","○","○","○","○","○","○","×","○","○","○","○","○","○","○","○","○","○","○","○","○","○","×","○","○","○","○","○","○","○","○","○","○","○","○","○","○","○","○","×","○","○","○","○","○","○","○","○","○","○","○","○","○","○","×","○","○","○","○","○","○","○","○","○","○","○","○","○","○","○","○","×","○","○","○","○","○","○","○","○","○","○","○","○","○","○","○","○","×","○","○","○","○","○","○","○","○","○","○","○","○","○","○","○","○","×","○","○","○","○","○","○","○","○","○","○","○","○","○","○","×","○","○","○","○","○","○","○","○","○","○","○","○","○","○","○","○","×","○","○","○","○","○","○","○","○","○","○","○","○","○","○","○","○","○","×","○","○","○","○","○","×","○","○","○","○","○","○","×","○","○","○","○","○","○","○","○","○","○","○","○","○","○","○","○","×","○","○","○","○","○","○","○","○","○","○","○","○","○","○","○","○","○","○","○","○","×","○","○","○","○","○","○","○","○","×","○",null,"A",null,null,"【文書番号】",null,null,null,null,null,null,null,1,"0001",0,0,0,1]
[22,null,null,"○","○","○","○","○","○","○","○","○","○","○","○","○","○","○","○","○","○","○","○","○","○","○","○","○","○","○","○","○","○","○","○","○","○","○","○","○","○","○","○","○","○","○","○","○","○","○","○","○","○","○","○","○","○","○","○","○","○","○","○","○","○","○","○","○","○","○","○","○","○","○","○","○","○","○","○","○","○","○","○","○","○","○","○","○","○","○","○","○","○","○","○","○","○","○","○","○","","○","","○","","○","","○","","○","","○","","○","","○","","○","","○","","○","","○","","○","","○","","○","","○","","○","","○","○","○","○","○","○","○","○","○","○","○","○","○","○","○","○","○","○","○","○","○","○","○","○","○","○","○","○","○","○","○","○","○","○","○","○","○","○","○","○","○","○","○","○","○","○","○","○","○","○","○","○","○","○","○","○","○","○","○","○","○","○","○","○","○","○","○","○","○","○","○","○","○","○","○","○","○","○","○","○","○","○","○","○","○","○","○","○","○","○","○","○","○","○","○","○","○","○","○","○","○","○","○","○","○","○","○","○","○","○","○","○","○","○","○","○","○","○","○","○","○","○","○","○","○","○","○","○","○","○","○","○","○","○","○","○","○","○","○","○","○","○","○","○","○","○","○","○","○","○","○","○","○","○","○","○","○","○","○","○","○","○","○","○","○","○","○","○","○","○","○","○","×","○","○","○","○","○","○","○","○","○","○","×","○","○","○","○","○","○","○","○","○","○","○","○","○","○","○","○","×","○","○","○","○","○","○","○","○","○","○","○","○","○","○","×","○","○","○","○","○","○","○","○","○","○","○","○","○","×","○","○","○","○","○","○","○","○","○","○","○","○","○","○","○","○","×","○","○","○","○","○","○","○","○","○","○","○","○","○","○","×","○","○","○","○","○","○","○","○","○","○","○","○","○","○","○","○","×","○","○","○","○","○","○","○","○","○","○","○","○","○","○","×","○","○","○","○","○","○","○","○","○","○","○","○","○","○","○","○","×","○","○","○","○","○","○","○","○","○","○","○","○","○","○","○","○","×","○","○","○","○","○","○","○","○","○","○","○","○","○","○","○","○","×","○","○","○","○","○","○","○","○","○","○","○","○","○","○","×","○","○","○","○","○","○","○","○","○","○","○","○","○","○","○","○","×","○","○","○","○","○","○","○","○","○","○","○","○","○","○","○","○","○","×","○","○","○","○","○","×","○","○","○","○","○","○","×","○","○","○","○","○","○","○","○","○","○","○","○","○","○","○","○","×","○","○","○","○","○","○","○","○","○","○","○","○","○","○","○","○","○","○","○","○","×","○","○","○","○","○","○","○","○","×","○",null,"A",null,null,"【機　　能】","想定した使われ方における提供機能のリストアップ",null,null,null,null,null,null,1,"0001",0,0,0,1,null,null,"Made a list of function to be offered for the expected circumstance for such use. "]
[23,null,null,"○","○","○","○","○","○","○","○","○","○","○","○","○","○","○","○","○","○","○","○","○","○","○","○","○","○","○","○","○","○","○","○","○","○","○","○","○","○","○","○","○","○","○","○","○","○","○","○","○","○","○","○","○","○","○","○","○","○","○","○","○","○","○","○","○","○","○","○","○","○","○","○","○","○","○","○","○","○","○","○","○","○","○","○","○","○","○","○","○","○","○","○","○","○","○","○","○","","○","","○","","○","","○","","○","","○","","○","","○","","○","","○","","○","","○","","○","","○","","○","","○","","○","","○","○","○","○","○","○","○","○","○","○","○","○","○","○","○","○","○","○","○","○","○","○","○","○","○","○","○","○","○","○","○","○","○","○","○","○","○","○","○","○","○","○","○","○","○","○","○","○","○","○","○","○","○","○","○","○","○","○","○","○","○","○","○","○","○","○","○","○","○","○","○","○","○","○","○","○","○","○","○","○","○","○","○","○","○","○","○","○","○","○","○","○","○","○","○","○","○","○","○","○","○","○","○","○","○","○","○","○","○","○","○","○","○","○","○","○","○","○","○","○","○","○","○","○","○","○","○","○","○","○","○","○","○","○","○","○","○","○","○","○","○","○","○","○","○","○","○","○","○","○","○","○","○","○","○","○","○","○","○","○","○","○","○","○","○","○","○","○","○","○","○","○","×","○","○","○","○","○","○","○","○","○","○","×","○","○","○","○","○","○","○","○","○","○","○","○","○","○","○","○","×","○","○","○","○","○","○","○","○","○","○","○","○","○","○","×","○","○","○","○","○","○","○","○","○","○","○","○","○","×","○","○","○","○","○","○","○","○","○","○","○","○","○","○","○","○","×","○","○","○","○","○","○","○","○","○","○","○","○","○","○","×","○","○","○","○","○","○","○","○","○","○","○","○","○","○","○","○","×","○","○","○","○","○","○","○","○","○","○","○","○","○","○","×","○","○","○","○","○","○","○","○","○","○","○","○","○","○","○","○","×","○","○","○","○","○","○","○","○","○","○","○","○","○","○","○","○","×","○","○","○","○","○","○","○","○","○","○","○","○","○","○","○","○","×","○","○","○","○","○","○","○","○","○","○","○","○","○","○","×","○","○","○","○","○","○","○","○","○","○","○","○","○","○","○","○","×","○","○","○","○","○","○","○","○","○","○","○","○","○","○","○","○","○","×","○","○","○","○","○","×","○","○","○","○","○","○","×","○","○","○","○","○","○","○","○","○","○","○","○","○","○","○","○","×","○","○","○","○","○","○","○","○","○","○","○","○","○","○","○","○","○","○","○","○","×","○","○","○","○","○","○","○","○","×","○",null,"A",null,null,null,"ユーザに提供されるスキャン機能を以下に示す","1) ScanToE-mail（メール送信）","スキャンしたデータをE-mailに添付して指定されたE-mailアドレスに送信する機能、スキャン画像をまず自分に送り、本文等を編集して他人に電子データとして配布することを目的とする",null,null,null,null,null,"","","","","",null,null,"Scan function to be provided to a user shall be as described below. ","1) ScanToE-mail (Mail send) ","スキャンしたデータをE-mailに添付して指定されたE-mailアドレスに送信する機能、スキャン画像をまず自分に送り、本文等を編集して他人に電子データとして配布することを目的とする"]
[24,null,null,"×","○","○","○","○","○","○","○","○","○","○","○","○","○","○","○","○","○","○","○","○","○","○","○","○","○","○","○","○","○","○","○","○","○","○","○","○","○","○","○","○","○","○","○","○","○","○","○","○","○","○","○","○","○","○","○","○","○","○","○","○","○","○","○","○","○","○","○","○","○","○","○","○","○","○","○","○","○","○","○","○","○","○","○","○","○","○","○","○","○","○","○","○","○","○","○","○","","○","","○","","○","","○","","○","","○","","○","","○","","○","","○","","○","","○","","○","","○","","○","","○","","○","","○","○","○","○","○","○","○","○","○","○","○","○","○","○","○","○","○","○","○","○","○","○","○","○","○","○","○","○","○","○","○","○","○","○","○","○","○","○","○","○","○","○","○","○","○","○","○","○","○","○","○","○","○","○","○","○","○","○","○","○","○","○","○","○","○","○","○","○","○","○","○","○","○","○","○","○","○","○","○","○","○","○","○","○","○","○","○","○","○","○","○","○","○","○","○","○","○","○","○","○","○","○","○","○","○","○","○","○","○","○","○","○","○","○","○","○","○","○","○","○","○","○","○","○","○","○","○","○","○","○","○","○","○","○","○","○","○","○","○","○","○","○","○","○","○","○","○","○","○","○","○","○","○","○","○","○","○","○","○","○","○","○","○","○","○","○","○","○","○","○","○","○","×","○","○","○","○","○","○","○","○","○","○","×","○","○","○","○","○","○","○","○","○","○","○","○","○","○","○","○","×","○","○","○","○","○","○","○","○","○","○","○","○","○","○","×","○","○","○","○","○","○","○","○","○","○","○","○","○","×","○","○","○","○","○","○","○","○","○","○","○","○","○","○","○","○","×","○","○","○","○","○","○","○","○","○","○","○","○","○","○","×","○","○","○","○","○","○","○","○","○","○","○","○","○","○","○","○","×","○","○","○","○","○","○","○","○","○","○","○","○","○","○","×","○","○","○","○","○","○","○","○","○","○","○","○","○","○","○","○","×","○","○","○","○","○","○","○","○","○","○","○","○","○","○","○","○","×","○","○","○","○","○","○","○","○","○","○","○","○","○","○","○","○","×","○","○","○","○","○","○","○","○","○","○","○","○","○","○","×","○","○","○","○","○","○","○","○","○","○","○","○","○","○","○","○","×","○","○","○","○","○","○","○","○","○","○","○","○","○","○","○","○","○","×","○","○","○","○","○","×","○","○","○","○","○","○","×","○","○","○","○","○","○","○","○","○","○","○","○","○","○","○","○","×","○","○","○","○","○","○","○","○","○","○","○","○","○","○","○","○","○","○","○","○","×","○","○","○","○","○","○","○","○","×","○",null,"-","-","-",null,null,null,"ただし、身近なグループメンバーへは、自分のメーラーで本文等の編集を行わずに直接送信することも考える",null,null,null,null,null,"","","","","",null,null,null,null,"ただし、身近なグループメンバーへは、自分のメーラーで本文等の編集を行わずに直接送信することも考える"]
[25,null,null,"○","○","○","○","○","○","○","○","○","○","○","○","○","○","○","○","○","○","○","○","○","○","○","○","○","○","○","○","○","○","○","○","○","○","○","○","○","○","○","○","○","○","○","○","○","○","○","○","○","○","○","○","○","○","○","○","○","○","○","○","○","○","○","○","○","○","○","○","○","○","○","○","○","○","○","○","○","○","○","○","○","○","○","○","○","○","○","○","○","○","○","○","○","○","○","○","○","","○","","○","","○","","○","","○","","○","","○","","○","","○","","○","","○","","○","","○","","○","","○","","○","","○","","○","○","○","○","○","○","○","○","○","○","○","○","○","○","○","○","○","○","○","○","○","○","○","○","○","○","○","○","○","○","○","○","○","○","○","○","○","○","○","○","○","○","○","○","○","○","○","○","○","○","○","○","○","○","○","○","○","○","○","○","○","○","○","○","○","○","○","○","○","○","○","○","○","○","○","○","○","○","○","○","○","○","○","○","○","○","○","○","○","○","○","○","○","○","○","○","○","○","○","○","○","○","○","○","○","○","○","○","○","○","○","○","○","○","○","○","○","○","○","○","○","○","○","○","○","○","○","○","○","○","○","○","○","○","○","○","○","○","○","○","○","○","○","○","○","○","○","○","○","○","○","○","○","○","○","○","○","○","○","○","○","○","○","○","○","○","○","○","○","○","○","○","×","○","○","○","○","○","○","○","○","○","○","×","○","○","○","○","○","○","○","○","○","○","○","○","○","○","○","○","×","○","○","○","○","○","○","○","○","○","○","○","○","○","○","×","○","○","○","○","○","○","○","○","○","○","○","○","○","×","○","○","○","○","○","○","○","○","○","○","○","○","○","○","○","○","×","○","○","○","○","○","○","○","○","○","○","○","○","○","○","×","○","○","○","○","○","○","○","○","○","○","○","○","○","○","○","○","×","○","○","○","○","○","○","○","○","○","○","○","○","○","○","×","○","○","○","○","○","○","○","○","○","○","○","○","○","○","○","○","×","○","○","○","○","○","○","○","○","○","○","○","○","○","○","○","○","×","○","○","○","○","○","○","○","○","○","○","○","○","○","○","○","○","×","○","○","○","○","○","○","○","○","○","○","○","○","○","○","×","○","○","○","○","○","○","○","○","○","○","○","○","○","○","○","○","×","○","○","○","○","○","○","○","○","○","○","○","○","○","○","○","○","○","×","○","○","○","○","○","×","○","○","○","○","○","○","×","○","○","○","○","○","○","○","○","○","○","○","○","○","○","○","○","×","○","○","○","○","○","○","○","○","○","○","○","○","○","○","○","○","○","○","○","○","×","○","○","○","○","○","○","○","○","×","○",null,"A",null,null,null,null,"2) ScanToFTP\n\n","デバイスで生成したスキャンデータを直接PCに送信する機能、画像を自席のPCに取込んで電子データとして個人用に管理することを目的とする",null,null,null,null,null,"","","","","",null,null,null,"2) ScanToFTP\n\n","Function that allows scanned data created in a device to be sent directly to PC.  Objective here is to manage such  image download onto own PC for personal use as an electrical data. \n"]
[26,null,null,"○","○","○","○","○","○","○","○","○","○","○","○","○","○","○","○","○","○","○","○","○","○","○","○","○","○","○","○","○","○","○","○","○","○","○","○","○","○","○","○","○","○","○","○","○","○","○","○","○","○","○","○","○","○","○","○","○","○","○","○","○","○","○","○","○","○","○","○","○","○","○","○","○","○","○","○","○","○","○","○","○","○","○","○","○","○","○","○","○","○","○","○","○","○","○","○","○","","○","","○","","○","","○","","○","","○","","○","","○","","○","","○","","○","","○","","○","","○","","○","","○","","○","","○","○","○","○","○","○","○","○","○","○","○","○","○","○","○","○","○","○","○","○","○","○","○","○","○","○","○","○","○","○","○","○","○","○","○","○","○","○","○","○","○","○","○","○","○","○","○","○","○","○","○","○","○","○","○","○","○","○","○","○","○","○","○","○","○","○","○","○","○","○","○","○","○","○","○","○","○","○","○","○","○","○","○","○","○","○","○","○","○","○","○","○","○","○","○","○","○","○","○","○","○","○","○","○","○","○","○","○","○","○","○","○","○","○","○","○","○","○","○","○","○","○","○","○","○","○","○","○","○","○","○","○","○","○","○","○","○","○","○","○","○","○","○","○","○","○","○","○","○","○","○","○","○","○","○","○","○","○","○","○","○","○","○","○","○","○","○","○","○","○","○","○","×","○","○","○","○","○","○","○","○","○","○","×","○","○","○","○","○","○","○","○","○","○","○","○","○","○","○","○","×","○","○","○","○","○","○","○","○","○","○","○","○","○","○","×","○","○","○","○","○","○","○","○","○","○","○","○","○","×","○","○","○","○","○","○","○","○","○","○","○","○","○","○","○","○","×","○","○","○","○","○","○","○","○","○","○","○","○","○","○","×","○","○","○","○","○","○","○","○","○","○","○","○","○","○","○","○","×","○","○","○","○","○","○","○","○","○","○","○","○","○","○","×","○","○","○","○","○","○","○","○","○","○","○","○","○","○","○","○","×","○","○","○","○","○","○","○","○","○","○","○","○","○","○","○","○","×","○","○","○","○","○","○","○","○","○","○","○","○","○","○","○","○","×","○","○","○","○","○","○","○","○","○","○","○","○","○","○","×","○","○","○","○","○","○","○","○","○","○","○","○","○","○","○","○","×","○","○","○","○","○","○","○","○","○","○","○","○","○","○","○","○","○","×","○","○","○","○","○","×","○","○","○","○","○","○","×","○","○","○","○","○","○","○","○","○","○","○","○","○","○","○","○","×","○","○","○","○","○","○","○","○","○","○","○","○","○","○","○","○","○","○","○","○","×","○","○","○","○","○","○","○","○","×","○",null,"A",null,null,null,null,null,"デバイスからファイルサーバ上の特定場所にスキャンデータを送信する機能、画像を共有サーバ上に取込んで電子データとして共有管理することを目的とする",null,null,null,null,null,"","","","","",null,null,null,null,"Function that allows a scanned data to be sent  to the specified place on a file server from a device.  Objective here is to download such image onto the shared server for mutual management as an electrical data. \n"]
[27,null,null,"○","○","○","○","○","○","○","○","○","○","○","○","○","○","○","○","○","○","○","○","○","○","○","○","○","○","○","○","○","○","○","○","○","○","○","○","○","○","○","○","○","○","○","○","○","○","○","○","○","○","○","○","○","○","○","○","○","○","○","○","○","○","○","○","○","○","○","○","○","○","○","○","○","○","○","○","○","○","○","○","○","○","○","○","○","○","○","○","○","○","○","○","○","○","○","○","○","","○","","○","","○","","○","","○","","○","","○","","○","","○","","○","","○","","○","","○","","○","","○","","○","","○","","○","○","○","○","○","○","○","○","○","○","○","○","○","○","○","○","○","○","○","○","○","○","○","○","○","○","○","○","○","○","○","○","○","○","○","○","○","○","○","○","○","○","○","○","○","○","○","○","○","○","○","○","○","○","○","○","○","○","○","○","○","○","○","○","○","○","○","○","○","○","○","○","○","○","○","○","○","○","○","○","○","○","○","○","○","○","○","○","○","○","○","○","○","○","○","○","○","○","○","○","○","○","○","○","○","○","○","○","○","○","○","○","○","○","○","○","○","○","○","○","○","○","○","○","○","○","○","○","○","○","○","○","○","○","○","○","○","○","○","○","○","○","○","○","○","○","○","○","○","○","○","○","○","○","○","○","○","○","○","○","○","○","○","○","○","○","○","○","○","○","○","○","×","○","○","○","○","○","○","○","○","○","○","×","○","○","○","○","○","○","○","○","○","○","○","○","○","○","○","○","×","○","○","○","○","○","○","○","○","○","○","○","○","○","○","×","○","○","○","○","○","○","○","○","○","○","○","○","○","×","○","○","○","○","○","○","○","○","○","○","○","○","○","○","○","○","×","○","○","○","○","○","○","○","○","○","○","○","○","○","○","×","○","○","○","○","○","○","○","○","○","○","○","○","○","○","○","○","×","○","○","○","○","○","○","○","○","○","○","○","○","○","○","×","○","○","○","○","○","○","○","○","○","○","○","○","○","○","○","○","×","○","○","○","○","○","○","○","○","○","○","○","○","○","○","○","○","×","○","○","○","○","○","○","○","○","○","○","○","○","○","○","○","○","×","○","○","○","○","○","○","○","○","○","○","○","○","○","○","×","○","○","○","○","○","○","○","○","○","○","○","○","○","○","○","○","×","○","○","○","○","○","○","○","○","○","○","○","○","○","○","○","○","○","×","○","○","○","○","○","×","○","○","○","○","○","○","×","○","○","○","○","○","○","○","○","○","○","○","○","○","○","○","○","×","○","○","○","○","○","○","○","○","○","○","○","○","○","○","○","○","○","○","○","○","×","○","○","○","○","○","○","○","○","×","○",null,"A",null,null,null,null,"3) ScanToPC(SMB)","デバイスで生成したスキャンデータを直接PCに送信する機能、画像を自席のPCに取込んで電子データとして個人用に管理することを目的とする\nPC側で受信ソフトを起動する必要がない\n",null,null,null,null,null,"","","","","",null,null,null,"3) ScanToPC(SMB)","Function that allows scanned data created in a device to be sent directly to PC. Objective here is to download such image onto own PC shall be for a personal management as an electrical data.  No need to activate a software on PC. \n\n\n"]
[28,null,null,"○","○","○","○","○","○","○","○","○","○","○","○","○","○","○","○","○","○","○","○","○","○","○","○","○","○","○","○","○","○","○","○","○","○","○","○","○","○","○","○","○","○","○","○","○","○","○","○","○","○","○","○","○","○","○","○","○","○","○","○","○","○","○","○","○","○","○","○","○","○","○","○","○","○","○","○","○","○","○","○","○","○","○","○","○","○","○","○","○","○","○","○","○","○","○","○","○","","○","","○","","○","","○","","○","","○","","○","","○","","○","","○","","○","","○","","○","","○","","○","","○","","○","","○","○","○","○","○","○","○","○","○","○","○","○","○","○","○","○","○","○","○","○","○","○","○","○","○","○","○","○","○","○","○","○","○","○","○","○","○","○","○","○","○","○","○","○","○","○","○","○","○","○","○","○","○","○","○","○","○","○","○","○","○","○","○","○","○","○","○","○","○","○","○","○","○","○","○","○","○","○","○","○","○","○","○","○","○","○","○","○","○","○","○","○","○","○","○","○","○","○","○","○","○","○","○","○","○","○","○","○","○","○","○","○","○","○","○","○","○","○","○","○","○","○","○","○","○","○","○","○","○","○","○","○","○","○","○","○","○","○","○","○","○","○","○","○","○","○","○","○","○","○","○","○","○","○","○","○","○","○","○","○","○","○","○","○","○","○","○","○","○","○","○","○","×","○","○","○","○","○","○","○","○","○","○","×","○","○","○","○","○","○","○","○","○","○","○","○","○","○","○","○","×","○","○","○","○","○","○","○","○","○","○","○","○","○","○","×","○","○","○","○","○","○","○","○","○","○","○","○","○","×","○","○","○","○","○","○","○","○","○","○","○","○","○","○","○","○","×","○","○","○","○","○","○","○","○","○","○","○","○","○","○","×","○","○","○","○","○","○","○","○","○","○","○","○","○","○","○","○","×","○","○","○","○","○","○","○","○","○","○","○","○","○","○","×","○","○","○","○","○","○","○","○","○","○","○","○","○","○","○","○","×","○","○","○","○","○","○","○","○","○","○","○","○","○","○","○","○","×","○","○","○","○","○","○","○","○","○","○","○","○","○","○","○","○","×","○","○","○","○","○","○","○","○","○","○","○","○","○","○","×","○","○","○","○","○","○","○","○","○","○","○","○","○","○","○","○","×","○","○","○","○","○","○","○","○","○","○","○","○","○","○","○","○","○","×","○","○","○","○","○","×","○","○","○","○","○","○","×","○","○","○","○","○","○","○","○","○","○","○","○","○","○","○","○","×","○","○","○","○","○","○","○","○","○","○","○","○","○","○","○","○","○","○","○","○","×","○","○","○","○","○","○","○","○","×","○",null,"A",null,null,null,null,null,"デバイスからファイルサーバ上の特定場所にスキャンデータを送信する機能、画像を共有サーバ上に取込んで電子データとして共有管理することを目的とする",null,null,null,null,null,"","","","","",null,null,null,null,"Function that allows a scanned data to be sent  to the specified place on a file server from a device.  Objective here is to download such image onto the shared server for mutual management as an electrical data. \n"]
[29,null,null,"○","○","○","○","○","○","○","○","○","○","○","○","○","○","○","○","○","○","○","○","○","○","○","○","○","○","○","○","○","○","○","○","○","○","○","○","○","○","○","○","○","○","○","○","○","○","○","○","○","○","○","○","○","○","○","○","○","○","○","○","○","○","○","○","○","○","○","○","○","○","○","○","○","○","○","○","○","○","○","○","○","○","○","○","○","○","○","○","○","○","○","○","○","○","○","○","○","","○","","○","","○","","○","","○","","○","","○","","○","","○","","○","","○","","○","","○","","○","","○","","○","","○","","○","○","○","○","○","○","○","○","○","○","○","○","○","○","○","○","○","○","○","○","○","○","○","○","○","○","○","○","○","○","○","○","○","○","○","○","○","○","○","○","×","×","○","○","○","○","○","○","○","○","○","○","○","○","○","○","○","○","○","○","○","○","○","○","○","○","○","○","○","○","○","○","○","○","○","○","○","○","○","○","○","○","○","○","○","○","○","○","○","○","○","○","○","○","○","○","○","○","○","○","○","○","○","○","○","○","○","○","○","○","○","○","○","○","○","○","○","○","○","○","○","○","○","○","○","○","○","○","○","○","○","○","○","○","○","○","○","○","○","○","○","○","○","○","○","○","○","○","○","○","○","○","○","○","○","○","○","○","○","○","○","○","○","○","○","○","○","○","○","○","○","○","×","○","○","○","○","○","○","○","○","○","○","×","○","○","○","○","○","○","○","○","○","○","○","○","○","○","○","○","×","○","○","○","○","○","○","○","○","○","○","○","○","○","○","×","○","○","○","○","○","○","○","○","○","○","○","○","○","×","○","○","○","○","○","○","○","○","○","○","○","○","○","○","○","○","×","○","○","○","○","○","○","○","○","○","○","○","○","○","○","×","○","○","○","○","○","○","○","○","○","○","○","○","○","○","○","○","×","○","○","○","○","○","○","○","○","○","○","○","○","○","○","×","○","○","○","○","○","○","○","○","○","○","○","○","○","○","○","○","×","○","○","○","○","○","○","○","○","○","○","○","○","○","○","○","○","×","○","○","○","○","○","○","○","○","○","○","○","○","○","○","○","○","×","○","○","○","○","○","○","○","○","○","○","○","○","○","○","×","○","○","○","○","○","○","○","○","○","○","○","○","○","○","○","○","×","○","○","○","○","○","○","○","○","○","○","○","○","○","○","○","○","○","×","○","○","○","○","○","×","○","○","○","○","○","○","×","○","○","○","○","○","○","○","○","○","○","○","○","○","○","○","○","×","○","○","○","○","○","○","○","○","○","○","○","○","○","○","○","○","○","○","○","○","×","○","○","○","○","○","○","○","○","×","○",null,"A","S",null,null,null,"5) ScanToBox（HDD保存)","スキャンデータをデバイス内蔵(本体、コントローラ)のHDDに送信する機能、画像の共有管理・公開、あるいは、個人管理用データの一時的な保管に利用することを目的とする",null,"(*5)",null,null,null,"","","","","",null,null,null,"5) ScanToBox（HDD stored)","Function that allows scanned data to be sent to HDD which is a built-in device (main unit, controller) Objective here is to use such scanned data for mutual management, exposure or a temporary management  of a personal data. ",null,null,null,null,null,null,null,null,null,null,null,null,null,null,null,null,null,null,null,null,null,null,null,null,null,null,null,null,null,null,null,null,null,null,null,null,null,"○"]
[30,null,null,"○","○","○","○","○","○","○","○","○","○","○","○","○","○","○","○","○","○","○","○","○","○","○","○","○","○","○","○","○","○","○","○","○","○","○","○","○","○","○","○","○","○","○","○","○","○","○","○","○","○","○","○","○","○","○","○","○","○","○","○","○","○","○","○","○","○","○","○","○","○","○","○","○","○","○","○","○","○","○","○","○","○","○","○","○","○","○","○","○","○","○","○","○","○","○","○","○","","○","","○","","○","","○","","○","","○","","○","","○","","○","","○","","○","","○","","○","","○","","○","","○","","○","","○","○","○","○","○","○","○","○","○","○","○","○","○","○","○","○","○","○","○","○","○","○","○","○","○","○","○","○","○","○","○","○","○","○","○","○","○","○","○","○","○","○","○","○","○","○","○","○","○","○","○","○","○","○","○","○","○","○","○","○","○","○","○","○","○","○","○","○","○","○","○","○","○","○","○","○","○","○","○","○","○","○","○","○","○","○","○","○","○","○","○","○","○","○","○","○","○","○","○","○","○","○","○","○","○","○","○","○","○","○","○","○","○","○","○","○","○","○","○","○","○","○","○","○","○","○","○","○","○","○","○","○","○","○","○","○","○","○","○","○","○","○","○","○","○","○","○","○","○","○","○","○","○","○","○","○","○","○","○","○","○","○","○","○","○","○","○","○","○","○","○","○","×","○","○","○","○","○","○","○","○","○","○","×","○","○","○","○","○","○","○","○","○","○","○","○","○","○","○","○","×","○","○","○","○","○","○","○","○","○","○","○","○","○","○","×","○","○","○","○","○","○","○","○","○","○","○","○","○","×","○","○","○","○","○","○","○","○","○","○","○","○","○","○","○","○","×","○","○","○","○","○","○","○","○","○","○","○","○","○","○","×","○","○","○","○","○","○","○","○","○","○","○","○","○","○","○","○","×","○","○","○","○","○","○","○","○","○","○","○","○","○","○","×","○","○","○","○","○","○","○","○","○","○","○","○","○","○","○","○","×","○","○","○","○","○","○","○","○","○","○","○","○","○","○","○","○","×","○","○","○","○","○","○","○","○","○","○","○","○","○","○","○","○","×","○","○","○","○","○","○","○","○","○","○","○","○","○","○","×","○","○","○","○","○","○","○","○","○","○","○","○","○","○","○","○","×","○","○","○","○","○","○","○","○","○","○","○","○","○","○","○","○","○","×","○","○","○","○","○","×","○","○","○","○","○","○","×","○","○","○","○","○","○","○","○","○","○","○","○","○","○","○","○","×","○","○","○","○","○","○","○","○","○","○","○","○","○","○","○","○","○","○","○","○","×","○","○","○","○","○","○","○","○","×","○",null,"A",null,null,null,null,"上記機能の同報送信設定(例えば、ScanToE-mailとScanToHDDの宛先に同時に画像を通知すること)可能",null,null,null,null,null,null,"","","","","",null,null,null,"Enables above mentioned function setting of broadcasting.  (Notifying the ScanToE-mail address and ScanToHDD address of image at the same time) "]
[31,null,null,"○","○","○","○","○","○","○","○","○","○","○","○","○","○","○","○","○","○","○","○","○","○","○","○","○","○","○","○","○","○","○","○","○","○","○","○","○","○","○","○","○","○","○","○","○","○","○","○","○","○","○","○","○","○","○","○","○","○","○","○","○","○","○","○","○","○","○","○","○","○","○","○","○","○","○","○","○","○","○","○","○","○","○","○","○","○","○","○","○","○","○","○","○","○","○","○","○","","○","","○","","○","","○","","○","","○","","○","","○","","○","","○","","○","","○","","○","","○","","○","","○","","○","","○","○","○","○","○","○","○","○","○","○","○","○","○","○","○","○","○","○","○","○","○","○","○","○","○","○","○","○","○","○","○","○","○","○","○","○","○","○","○","○","○","○","○","○","○","○","○","○","○","○","○","○","○","○","○","○","○","○","○","○","○","○","○","○","○","○","○","○","○","○","○","○","○","○","○","○","○","○","○","○","○","○","○","○","○","○","○","○","○","○","○","○","○","○","○","○","○","○","○","○","○","○","○","○","○","○","○","○","○","○","○","○","○","○","○","○","○","○","○","○","○","○","○","○","○","○","○","○","○","○","○","○","○","○","○","○","○","○","○","○","○","○","○","○","○","○","○","○","○","○","○","○","○","○","○","○","○","○","○","○","○","○","○","○","○","○","○","○","○","○","○","○","×","○","○","○","○","○","○","○","○","○","○","×","○","○","○","○","○","○","○","○","○","○","○","○","○","○","○","○","×","○","○","○","○","○","○","○","○","○","○","○","○","○","○","×","○","○","○","○","○","○","○","○","○","○","○","○","○","×","○","○","○","○","○","○","○","○","○","○","○","○","○","○","○","○","×","○","○","○","○","○","○","○","○","○","○","○","○","○","○","×","○","○","○","○","○","○","○","○","○","○","○","○","○","○","○","○","×","○","○","○","○","○","○","○","○","○","○","○","○","○","○","×","○","○","○","○","○","○","○","○","○","○","○","○","○","○","○","○","×","○","○","○","○","○","○","○","○","○","○","○","○","○","○","○","○","×","○","○","○","○","○","○","○","○","○","○","○","○","○","○","○","○","×","○","○","○","○","○","○","○","○","○","○","○","○","○","○","×","○","○","○","○","○","○","○","○","○","○","○","○","○","○","○","○","×","○","○","○","○","○","○","○","○","○","○","○","○","○","○","○","○","○","×","○","○","○","○","○","×","○","○","○","○","○","○","×","○","○","○","○","○","○","○","○","○","○","○","○","○","○","○","○","×","○","○","○","○","○","○","○","○","○","○","○","○","○","○","○","○","○","○","○","○","×","○","○","○","○","○","○","○","○","×","○",null,"A",null,null,null,null,"6) Real Mode TWAIN","PC上からデバイスをネットワーク経由で制御しスキャンデータをアプリケーション上に直接取り込む機能、直接アプリケーション上から画像の編集・補正等を行うことを目的とする",null,null,null,null,null,"","","","","",null,null,null,"6) Real Mode TWAIN","Function that allows a device to control on PC via the network and to download on application directly.  Objective here is to edit and adjust an image directly on the application.  "]
[32,null,null,"○","○","○","○","○","○","○","○","○","○","○","○","○","○","○","○","○","○","○","○","○","○","○","○","○","○","○","○","○","○","○","○","○","○","○","○","○","○","○","○","○","○","○","○","○","○","○","○","○","○","○","○","○","○","○","○","○","○","○","○","○","○","○","○","○","○","○","○","○","○","○","○","○","○","○","○","○","○","○","○","○","○","○","○","○","○","○","○","○","○","○","○","○","○","○","○","○","","○","","○","","○","","○","","○","","○","","○","","○","","○","","○","","○","","○","","○","","○","","○","","○","","○","","○","○","○","○","○","○","○","○","○","○","○","○","○","○","○","○","○","○","○","○","○","○","○","○","○","○","○","○","○","○","○","○","○","○","○","○","○","○","○","○","×","×","○","○","○","○","○","○","○","○","○","○","○","○","○","○","○","○","○","○","○","○","○","○","○","○","○","○","○","○","○","○","○","○","○","○","○","○","○","○","○","○","○","○","○","○","○","○","○","○","○","○","○","○","○","○","○","○","○","○","○","○","○","○","○","○","○","○","○","○","○","○","○","○","○","○","○","○","○","○","○","○","○","○","○","○","○","○","○","○","○","○","○","○","○","○","○","○","○","○","○","○","○","○","○","○","○","○","○","○","○","○","○","○","○","○","○","○","○","○","○","○","○","○","○","○","○","○","○","○","○","○","×","○","○","○","○","○","○","○","○","○","○","×","○","○","○","○","○","○","○","○","○","○","○","○","○","○","○","○","×","○","○","○","○","○","○","○","○","○","○","○","○","○","○","×","○","○","○","○","○","○","○","○","○","○","○","○","○","×","○","○","○","○","○","○","○","○","○","○","○","○","○","○","○","○","×","○","○","○","○","○","○","○","○","○","○","○","○","○","○","×","○","○","○","○","○","○","○","○","○","○","○","○","○","○","○","○","×","○","○","○","○","○","○","○","○","○","○","○","○","○","○","×","○","○","○","○","○","○","○","○","○","○","○","○","○","○","○","○","×","○","○","○","○","○","○","○","○","○","○","○","○","○","○","○","○","×","○","○","○","○","○","○","○","○","○","○","○","○","○","○","○","○","×","○","○","○","○","○","○","○","○","○","○","○","○","○","○","×","○","○","○","○","○","○","○","○","○","○","○","○","○","○","○","○","×","○","○","○","○","○","○","○","○","○","○","○","○","○","○","○","○","○","×","○","○","○","○","○","×","○","○","○","○","○","○","×","○","○","○","○","○","○","○","○","○","○","○","○","○","○","○","○","×","○","○","○","○","○","○","○","○","○","○","○","○","○","○","○","○","○","○","○","○","×","○","○","○","○","○","○","○","○","×","○",null,"A","S",null,null,null,"7) HDD TWAIN","PC上からデバイスをネットワーク経由で制御しBoxに保存されているデータをアプリケーション上に直接取り込む機能。直接アプリケーション上から画像の編集・補正等を行うことを目的とする",null,"(*5)",null,null,null,"","","","","",null,null,null,"7) HDD TWAIN","Function that allows to download the data stored in the Box directly on application using a control of a device on PC via the network.  Objective here is to edit and adjust an image directly on an application. \n",null,null,null,null,null,null,null,null,null,null,null,null,null,null,null,null,null,null,null,null,null,null,null,null,null,null,null,null,null,null,null,null,null,null,null,null,null,"○"]
["32-2",null,null,"○","○","○","○","○","○","○","○","○","○","○","○","○","○","○","○","○","○","○","○","○","○","○","○","○","○","○","○","○","○","○","○","○","○","○","○","○","○","○","○","○","○","○","○","○","○","○","○","○","○","○","○","○","○","○","○","○","○","○","○","○","○","○","○","○","○","○","○","○","○","○","○","○","○","○","○","○","○","○","○","○","○","○","○","○","○","○","○","○","○","○","○","○","○","○","○","○","","○","","○","","○","","○","","○","","○","","○","","○","","○","","○","","○","","○","","○","","○","","○","","○","","○","","○","○","○","○","○","○","○","○","○","○","○","○","○","○","○","○","○","○","○","○","○","○","○","○","○","○","○","○","○","○","○","○","○","○","○","○","○","○","○","○","○","○","○","○","○","○","○","○","○","○","○","○","○","○","○","○","○","○","○","○","○","○","○","○","○","○","○","○","○","○","○","○","○","○","○","○","○","○","○","○","○","○","○","○","○","○","○","○","○","○","○","○","○","○","○","○","○","○","○","○","○","○","○","○","○","○","○","○","○","○","○","○","○","○","○","○","○","○","○","○","○","○","○","○","○","○","○","○","○","○","○","○","○","○","○","○","○","○","○","○","○","○","○","○","○","○","○","○","○","○","○","○","○","○","○","○","○","○","○","○","○","○","○","○","○","○","○","○","○","○","○","○","×","○","○","○","○","○","○","○","○","○","○","×","○","○","○","○","○","○","○","○","○","○","○","○","○","○","○","○","×","○","○","○","○","○","○","○","○","○","○","○","○","○","○","×","○","○","○","○","○","○","○","○","○","○","○","○","○","×","○","○","○","○","○","○","○","○","○","○","○","○","○","○","○","○","×","○","○","○","○","○","○","○","○","○","○","○","○","○","○","×","○","○","○","○","○","○","○","○","○","○","○","○","○","○","○","○","×","○","○","○","○","○","○","○","○","○","○","○","○","○","○","×","○","○","○","○","○","○","○","○","○","○","○","○","○","○","○","○","×","○","○","○","○","○","○","○","○","○","○","○","○","○","○","○","○","×","○","○","○","○","○","○","○","○","○","○","○","○","○","○","○","○","×","○","○","○","○","○","○","○","○","○","○","○","○","○","○","×","○","○","○","○","○","○","○","○","○","○","○","○","○","○","○","○","×","○","○","○","○","○","○","○","○","○","○","○","○","○","○","○","○","○","×","○","○","○","○","○","×","○","○","○","○","○","○","×","○","○","○","○","○","○","○","○","○","○","○","○","○","○","○","○","×","○","○","○","○","○","○","○","○","○","○","○","○","○","○","○","○","○","○","○","○","×","○","○","○","○","○","○","○","○","×","○",null,"A",null,null,null,null,"8)  WSDスキャン","PC上からデバイスをWebServiceOnDevice(WSD)スキャン機能を使用しネットワーク経由で制御しスキャンデータをPC上に直接取り込む機能、直接PC上から画像を取り込むことを目的とする。WSDスキャンは、。Windows Vista 以降のWindows OS で対応されている。",null,null,null,null,1,"0001",0,0,0,1]
["32-3",null,null,"○","○","○","○","○","○","○","○","○","○","○","○","○","○","○","○","○","○","○","○","○","○","○","○","○","○","○","○","○","○","○","○","○","○","○","○","○","○","○","○","○","○","○","○","○","○","○","○","○","○","○","○","○","○","○","○","○","○","○","○","○","○","○","○","○","○","○","○","○","○","○","○","○","○","○","○","○","○","○","○","○","○","○","○","○","○","○","○","○","○","○","○","○","○","○","○","○","","○","","○","","○","","○","","○","","○","","○","","○","","○","","○","","○","","○","","○","","○","","○","","○","","○","","○","○","○","○","○","○","○","○","○","○","○","○","○","○","○","○","○","○","○","○","○","○","○","○","○","○","○","○","○","○","○","○","○","○","○","○","○","○","○","○","○","○","○","○","○","○","○","○","○","○","○","○","○","○","○","○","○","○","○","○","○","○","○","○","○","○","○","○","○","○","○","○","○","○","○","○","○","○","○","○","○","○","○","○","○","○","○","○","○","○","○","○","○","○","○","○","○","○","○","○","○","○","○","○","○","○","○","○","○","○","○","○","○","○","○","○","○","○","○","○","○","○","○","○","○","○","○","○","○","○","○","○","○","○","○","○","○","○","○","○","○","○","○","○","○","○","○","○","○","○","○","○","○","○","○","○","○","○","○","○","○","○","○","○","○","○","○","○","○","○","○","○","×","○","○","○","○","○","○","○","○","○","○","×","○","○","○","○","○","○","○","○","○","○","○","○","○","○","○","○","×","○","○","○","○","○","○","○","○","○","○","○","○","○","○","×","○","○","○","○","○","○","○","○","○","○","○","○","○","×","○","○","○","○","○","○","○","○","○","○","○","○","○","○","○","○","×","○","○","○","○","○","○","○","○","○","○","○","○","○","○","×","○","○","○","○","○","○","○","○","○","○","○","○","○","○","○","○","×","○","○","○","○","○","○","○","○","○","○","○","○","○","○","×","○","○","○","○","○","○","○","○","○","○","○","○","○","○","○","○","×","○","○","○","○","○","○","○","○","○","○","○","○","○","○","○","○","×","○","○","○","○","○","○","○","○","○","○","○","○","○","○","○","○","×","○","○","○","○","○","○","○","○","○","○","○","○","○","○","×","○","○","○","○","○","○","○","○","○","○","○","○","○","○","○","○","×","○","○","○","○","○","○","○","○","○","○","○","○","○","○","○","○","○","×","○","○","○","○","○","×","○","○","○","○","○","○","×","○","○","○","○","○","○","○","○","○","○","○","○","○","○","○","○","×","○","○","○","○","○","○","○","○","○","○","○","○","○","○","○","○","○","○","○","○","×","○","○","○","○","○","○","○","○","×","○",null,"A",null,null,null,null,null,null,"WebServiceOnDevice(WSD)のネットワーク設定に関しては、06_ユーティリティ.xlsネットワーク設定シートを参照願います。",null,null,null,1,"0001",0,0,0,1]
["32-4",null,null,"○","○","○","○","○","○","○","○","○","○","○","○","○","○","○","○","○","○","○","○","○","○","○","○","○","○","○","○","○","○","○","○","○","○","○","○","○","○","○","○","○","○","○","○","○","○","○","○","○","○","○","○","○","○","○","○","○","○","○","○","○","○","○","○","○","○","○","○","○","○","○","○","○","○","○","○","○","○","○","○","○","○","○","○","○","○","○","○","○","○","○","○","○","○","○","○","○","","○","","○","","○","","○","","○","","○","","○","","○","","○","","○","","○","","○","","○","","○","","○","","○","","○","","○","○","○","○","○","○","○","○","○","○","○","○","○","○","○","○","○","○","○","○","○","○","○","○","○","○","○","○","○","○","○","○","○","○","○","○","○","○","○","○","○","○","○","○","○","○","○","○","○","○","○","○","○","○","○","○","○","○","○","○","○","○","○","○","○","○","○","○","○","○","○","○","○","○","○","○","○","○","○","○","○","○","○","○","○","○","○","○","○","○","○","○","○","○","○","○","○","○","○","○","○","○","○","○","○","○","○","○","○","○","○","○","○","○","○","○","○","○","○","○","○","○","○","○","○","○","○","○","○","○","○","○","○","○","○","○","○","○","○","○","○","○","○","○","○","○","○","○","○","○","○","○","○","○","○","○","○","○","○","○","○","○","○","○","○","○","○","○","○","○","○","○","×","○","○","○","○","○","○","○","○","○","○","×","○","○","○","○","○","○","○","○","○","○","○","○","○","○","○","○","×","○","○","○","○","○","○","○","○","○","○","○","○","○","○","×","○","○","○","○","○","○","○","○","○","○","○","○","○","×","○","○","○","○","○","○","○","○","○","○","○","○","○","○","○","○","×","○","○","○","○","○","○","○","○","○","○","○","○","○","○","×","○","○","○","○","○","○","○","○","○","○","○","○","○","○","○","○","×","○","○","○","○","○","○","○","○","○","○","○","○","○","○","×","○","○","○","○","○","○","○","○","○","○","○","○","○","○","○","○","×","○","○","○","○","○","○","○","○","○","○","○","○","○","○","○","○","×","○","○","○","○","○","○","○","○","○","○","○","○","○","○","○","○","×","○","○","○","○","○","○","○","○","○","○","○","○","○","○","×","○","○","○","○","○","○","○","○","○","○","○","○","○","○","○","○","×","○","○","○","○","○","○","○","○","○","○","○","○","○","○","○","○","○","×","○","○","○","○","○","×","○","○","○","○","○","○","×","○","○","○","○","○","○","○","○","○","○","○","○","○","○","○","○","×","○","○","○","○","○","○","○","○","○","○","○","○","○","○","○","○","○","○","○","○","×","○","○","○","○","○","○","○","○","×","○",null,"A",null,null,null,null,null,null,"WebServiceOnDevice(WSD)のNICFUM機能に関しては「Webサービス機能仕様書」を参照願います。",null,null,null,1,"0001",0,0,0,1]
[null,null,null,"○","×","×","×","×","×","×","×","×","×","×","×","×","×","×","×","×","×","×","×","×","×","×","×","×","×","×","×","×","×","×","×","×","×","×","×","×","×","×","×","×","×","×","×","×","×","×","×","×","×","×","×","×","×","×","×","×","×","×","×","×","×","×","×","×","×","×","×","×","×","×","×","×","×","×","×","×","×","×","×","×","×","×","×","×","×","×","×","×","×","×","×","×","×","×","×","×",null,"×",null,"×",null,"×",null,"×",null,"×",null,"×",null,"×",null,"×",null,"×",null,"×",null,"×",null,"×",null,"×",null,"×",null,"×",null,"×",null,"×",null,"×","×","×","○","○","○","○","○","○","○","○","○","○","○","○","○","○","○","○","○","○","○","○","○","○","○","○","○","○","○","○","○","○","○","○","○","○","○","○","○","○","○","○","○","○","○","○","○","○","○","○","○","○","○","○","○","○","○","○","○","○","○","○","○","○","○","○","○","○","○","○","○","○","○","○","○","○","○","○","○","○","○","○","○","○","○","○","○","○","○","○","○","○","○","○","○","○","○","○","○","○","○","○","○","○","○","○","○","○","○","○","○","○","○","○","○","○","○","○","○","○","○","○","○","○","○","○","○","○","○","○","○","○","○","○","○","○","○","○","○","○","○","○","○","○","○","○","○","○","○","○","○","○","○","○","○","○","○","○","○","○","○","○","○","○","○","○","○","○","○","○","○","×","○","○","○","○","○","○","○","○","○","○","×","○","○","○","○","○","○","○","○","○","○","○","○","○","○","○","○","×","○","○","○","○","○","○","○","○","○","○","○","○","○","○","×","○","○","○","○","○","○","○","○","○","○","○","○","○","×","○","○","○","○","○","○","○","○","○","○","○","○","○","○","○","○","×","○","○","○","○","○","○","○","○","○","○","○","○","○","○","×","○","○","○","○","○","○","○","○","○","○","○","○","○","○","○","○","×","○","○","○","○","○","○","○","○","○","○","○","○","○","○","×","○","○","○","○","○","○","○","○","○","○","○","○","○","○","○","○","×","○","○","○","○","○","○","○","○","○","○","○","○","○","○","○","○","×","○","○","○","○","○","○","○","○","○","○","○","○","○","○","○","○","×","○","○","○","○","○","○","○","○","○","○","○","○","○","○","×","○","○","○","○","○","○","○","○","○","○","○","○","○","○","○","○","×","○","○","○","○","○","○","○","○","○","○","○","○","○","○","○","○","○","×","○","○","○","○","○","×","○","○","○","○","○","○","×","○","○","○","○","○","○","○","○","○","○","○","○","○","○","○","○","×","○","○","○","○","○","○","○","○","○","○","○","○","○","○","○","○","○","○","○","○","×","○","○","○","○","○","○","○","○","×","○",null,"A",null,null,null,null,"9）Panel Link スキャン(*2)(*3)","MFPでスキャンした画像を、モバイル端末に取り込む事や、クラウドサービスを活用する事、さらにそれを編集する機能。\nMFPで取り込んだ画像を個人のモバイル端末で活用することを目的とする。",null,"(*4)",null,null,1,"0001",0,0,0,1,null,null,null,null,null,null,null,null,null,null,null,null,null,null,null,null,null,null,null,null,null,null,null,null,null,null,null,null,"○",null,"○",null,null,null,null,null,"○"]
[null,null,null,"○","×","×","×","×","×","×","×","×","×","×","×","×","×","×","×","×","×","×","×","×","×","×","×","×","×","×","×","×","×","×","×","×","×","×","×","×","×","×","×","×","×","×","×","×","×","×","×","×","×","×","×","×","×","×","×","×","×","×","×","×","×","×","×","×","×","×","×","×","×","×","×","×","×","×","×","×","×","×","×","×","×","×","×","×","×","×","×","×","×","×","×","×","×","×","×","×",null,"×",null,"×",null,"×",null,"×",null,"×",null,"×",null,"×",null,"×",null,"×",null,"×",null,"×",null,"×",null,"×",null,"×",null,"×",null,"×",null,"×",null,"×","×","×","○","○","○","○","○","○","○","○","○","○","○","○","○","○","○","○","○","○","○","○","○","○","○","○","○","○","○","○","○","○","○","○","○","○","○","○","○","○","○","○","○","○","○","○","○","○","○","○","○","○","○","○","○","○","○","○","○","○","○","○","○","○","○","○","○","○","○","○","○","○","○","○","○","○","○","○","○","○","○","○","○","○","○","○","○","○","○","○","○","○","○","○","○","○","○","○","○","○","○","○","○","○","○","○","○","○","○","○","○","○","○","○","○","○","○","○","○","○","○","○","○","○","○","○","○","○","○","○","○","○","○","○","○","○","○","○","○","○","○","○","○","○","○","○","○","○","○","○","○","○","○","○","○","○","○","○","○","○","○","○","○","○","○","○","○","○","○","○","○","×","○","○","○","○","○","○","○","○","○","○","×","○","○","○","○","○","○","○","○","○","○","○","○","○","○","○","○","×","○","○","○","○","○","○","○","○","○","○","○","○","○","○","×","○","○","○","○","○","○","○","○","○","○","○","○","○","×","○","○","○","○","○","○","○","○","○","○","○","○","○","○","○","○","×","○","○","○","○","○","○","○","○","○","○","○","○","○","○","×","○","○","○","○","○","○","○","○","○","○","○","○","○","○","○","○","×","○","○","○","○","○","○","○","○","○","○","○","○","○","○","×","○","○","○","○","○","○","○","○","○","○","○","○","○","○","○","○","×","○","○","○","○","○","○","○","○","○","○","○","○","○","○","○","○","×","○","○","○","○","○","○","○","○","○","○","○","○","○","○","○","○","×","○","○","○","○","○","○","○","○","○","○","○","○","○","○","×","○","○","○","○","○","○","○","○","○","○","○","○","○","○","○","○","×","○","○","○","○","○","○","○","○","○","○","○","○","○","○","○","○","○","×","○","○","○","○","○","×","○","○","○","○","○","○","×","○","○","○","○","○","○","○","○","○","○","○","○","○","○","○","○","×","○","○","○","○","○","○","○","○","○","○","○","○","○","○","○","○","○","○","○","○","×","○","○","○","○","○","○","○","○","×","○",null,"A",null,null,null,null,null,null,"参照\n10_システム連携機能.xls\n2.基本的な操作動作","(*4)",null,null,1,"0001",0,0,0,1,null,null,null,null,null,null,null,null,null,null,null,null,null,null,null,null,null,null,null,null,null,null,null,null,null,null,null,null,"○",null,null,null,null,null,null,null,"○"]
[33,null,null,"○","○","○","○","○","○","○","○","○","○","○","○","○","○","○","○","○","○","○","○","○","○","○","○","○","○","○","○","○","○","○","○","○","○","○","○","○","○","○","○","○","○","○","○","○","○","○","○","○","○","○","○","○","○","○","○","○","○","○","○","○","○","○","○","○","○","○","○","○","○","○","○","○","○","○","○","○","○","○","○","○","○","○","○","○","○","○","○","○","○","○","○","○","○","○","○","○","","○","","○","","○","","○","","○","","○","","○","","○","","○","","○","","○","","○","","○","","○","","○","","○","","○","","○","○","○","○","○","○","○","○","○","○","○","○","○","○","○","○","○","○","○","○","○","○","○","○","○","○","○","○","○","○","○","○","○","○","○","○","○","○","○","○","○","○","○","○","○","○","○","○","○","○","○","○","○","○","○","○","○","○","○","○","○","○","○","○","○","○","○","○","○","○","○","○","○","○","○","○","○","○","○","○","○","○","○","○","○","○","○","○","○","○","○","○","○","○","○","○","○","○","○","○","○","○","○","○","○","○","○","○","○","○","○","○","○","○","○","○","○","○","○","○","○","○","○","○","○","○","○","○","○","○","○","○","○","○","○","○","○","○","○","○","○","○","○","○","○","○","○","○","○","○","○","○","○","○","○","○","○","○","○","○","○","○","○","○","○","○","○","○","○","○","○","○","×","○","○","○","○","○","○","○","○","○","○","×","○","○","○","○","○","○","○","○","○","○","○","○","○","○","○","○","×","○","○","○","○","○","○","○","○","○","○","○","○","○","○","×","○","○","○","○","○","○","○","○","○","○","○","○","○","×","○","○","○","○","○","○","○","○","○","○","○","○","○","○","○","○","×","○","○","○","○","○","○","○","○","○","○","○","○","○","○","×","○","○","○","○","○","○","○","○","○","○","○","○","○","○","○","○","×","○","○","○","○","○","○","○","○","○","○","○","○","○","○","×","○","○","○","○","○","○","○","○","○","○","○","○","○","○","○","○","×","○","○","○","○","○","○","○","○","○","○","○","○","○","○","○","○","×","○","○","○","○","○","○","○","○","○","○","○","○","○","○","○","○","×","○","○","○","○","○","○","○","○","○","○","○","○","○","○","×","○","○","○","○","○","○","○","○","○","○","○","○","○","○","○","○","×","○","○","○","○","○","○","○","○","○","○","○","○","○","○","○","○","○","×","○","○","○","○","○","×","○","○","○","○","○","○","×","○","○","○","○","○","○","○","○","○","○","○","○","○","○","○","○","×","○","○","○","○","○","○","○","○","○","○","○","○","○","○","○","○","○","○","○","○","×","○","○","○","○","○","○","○","○","×","○",null,"A",null,null,null,"ユーザに提供されるスキャン関連インターフェースを以下に示す","1) 本体パネルから","スキャンモード入力","本体起動のスキャンのモードを設定・表示する",null,null,null,null,"","","","","",null,null,"Scan relating interface offered to a user shall be as described below. ","1) From main unit panel ","Scan mode entry ","Setting or displaying of scan mode for the main unit start-up scan."]
[34,null,null,"○","○","○","○","○","○","○","○","○","○","○","○","○","○","○","○","○","○","○","○","○","○","○","○","○","○","○","○","○","○","○","○","○","○","○","○","○","○","○","○","○","○","○","○","○","○","○","○","○","○","○","○","○","○","○","○","○","○","○","○","○","○","○","○","○","○","○","○","○","○","○","○","○","○","○","○","○","○","○","○","○","○","○","○","○","○","○","○","○","○","○","○","○","○","○","○","○","","○","","○","","○","","○","","○","","○","","○","","○","","○","","○","","○","","○","","○","","○","","○","","○","","○","","○","○","○","○","○","○","○","○","○","○","○","○","○","○","○","○","○","○","○","○","○","○","○","○","○","○","○","○","○","○","○","○","○","○","○","○","○","○","○","○","○","○","○","○","○","○","○","○","○","○","○","○","○","○","○","○","○","○","○","○","○","○","○","○","○","○","○","○","○","○","○","○","○","○","○","○","○","○","○","○","○","○","○","○","○","○","○","○","○","○","○","○","○","○","○","○","○","○","○","○","○","○","○","○","○","○","○","○","○","○","○","○","○","○","○","○","○","○","○","○","○","○","○","○","○","○","○","○","○","○","○","○","○","○","○","○","○","○","○","○","○","○","○","○","○","○","○","○","○","○","○","○","○","○","○","○","○","○","○","○","○","○","○","○","○","○","○","○","○","○","○","○","×","○","○","○","○","○","○","○","○","○","○","×","○","○","○","○","○","○","○","○","○","○","○","○","○","○","○","○","×","○","○","○","○","○","○","○","○","○","○","○","○","○","○","×","○","○","○","○","○","○","○","○","○","○","○","○","○","×","○","○","○","○","○","○","○","○","○","○","○","○","○","○","○","○","×","○","○","○","○","○","○","○","○","○","○","○","○","○","○","×","○","○","○","○","○","○","○","○","○","○","○","○","○","○","○","○","×","○","○","○","○","○","○","○","○","○","○","○","○","○","○","×","○","○","○","○","○","○","○","○","○","○","○","○","○","○","○","○","×","○","○","○","○","○","○","○","○","○","○","○","○","○","○","○","○","×","○","○","○","○","○","○","○","○","○","○","○","○","○","○","○","○","×","○","○","○","○","○","○","○","○","○","○","○","○","○","○","×","○","○","○","○","○","○","○","○","○","○","○","○","○","○","○","○","×","○","○","○","○","○","○","○","○","○","○","○","○","○","○","○","○","○","×","○","○","○","○","○","×","○","○","○","○","○","○","×","○","○","○","○","○","○","○","○","○","○","○","○","○","○","○","○","×","○","○","○","○","○","○","○","○","○","○","○","○","○","○","○","○","○","○","○","○","×","○","○","○","○","○","○","○","○","×","○",null,"A",null,null,null,null,null,"直接アドレス入力","本体パネル上から直接アドレスを入力する",null,null,null,null,"","","","","",null,null,null,null,"Direct address entry","Direct address entry on the main unit panel. "]
[35,null,null,"○","○","○","○","○","○","○","○","○","○","○","○","○","○","○","○","○","○","○","○","○","○","○","○","○","○","○","○","○","○","○","○","○","○","○","○","○","○","○","○","○","○","○","○","○","○","○","○","○","○","○","○","○","○","○","○","○","○","○","○","○","○","○","○","○","○","○","○","○","○","○","○","○","○","○","○","○","○","○","○","○","○","○","○","○","○","○","○","○","○","○","○","○","○","○","○","○","","○","","○","","○","","○","","○","","○","","○","","○","","○","","○","","○","","○","","○","","○","","○","","○","","○","","○","○","○","○","○","○","○","○","○","○","○","○","○","○","○","○","○","○","○","○","○","○","○","○","○","○","○","○","○","○","○","○","○","○","○","○","○","○","○","○","○","○","○","○","○","○","○","○","○","○","○","○","○","○","○","○","○","○","○","○","○","○","○","○","○","○","○","○","○","○","○","○","○","○","○","○","○","○","○","○","○","○","○","○","○","○","○","○","○","○","○","○","○","○","○","○","○","○","○","○","○","○","○","○","○","○","○","○","○","○","○","○","○","○","○","○","○","○","○","○","○","○","○","○","○","○","○","○","○","○","○","○","○","○","○","○","○","○","○","○","○","○","○","○","○","○","○","○","○","○","○","○","○","○","○","○","○","○","○","○","○","○","○","○","○","○","○","○","○","○","○","○","×","○","○","○","○","○","○","○","○","○","○","×","○","○","○","○","○","○","○","○","○","○","○","○","○","○","○","○","×","○","○","○","○","○","○","○","○","○","○","○","○","○","○","×","○","○","○","○","○","○","○","○","○","○","○","○","○","×","○","○","○","○","○","○","○","○","○","○","○","○","○","○","○","○","×","○","○","○","○","○","○","○","○","○","○","○","○","○","○","×","○","○","○","○","○","○","○","○","○","○","○","○","○","○","○","○","×","○","○","○","○","○","○","○","○","○","○","○","○","○","○","×","○","○","○","○","○","○","○","○","○","○","○","○","○","○","○","○","×","○","○","○","○","○","○","○","○","○","○","○","○","○","○","○","○","×","○","○","○","○","○","○","○","○","○","○","○","○","○","○","○","○","×","○","○","○","○","○","○","○","○","○","○","○","○","○","○","×","○","○","○","○","○","○","○","○","○","○","○","○","○","○","○","○","×","○","○","○","○","○","○","○","○","○","○","○","○","○","○","○","○","○","×","○","○","○","○","○","×","○","○","○","○","○","○","×","○","○","○","○","○","○","○","○","○","○","○","○","○","○","○","○","×","○","○","○","○","○","○","○","○","○","○","○","○","○","○","○","○","○","○","○","○","×","○","○","○","○","○","○","○","○","×","○",null,"A",null,null,null,null,null,"短縮宛先登録","宛先情報を登録（本体メモリに保存される)する。宛先情報入力作業を簡易化するために使用する。",null,null,null,null,"","","","","",null,null,null,null,"Address book registration ","Registration of address information. (stored in memory of the main unit) This shall be used to simplify address information entry works.  "]
[36,null,null,"○","○","○","○","○","○","○","○","○","○","○","○","○","○","○","○","○","○","○","○","○","○","○","○","○","○","○","○","○","○","○","○","○","○","○","○","○","○","○","○","○","○","○","○","○","○","○","○","○","○","○","○","○","○","○","○","○","○","○","○","○","○","○","○","○","○","○","○","○","○","○","○","○","○","○","○","○","○","○","○","○","○","○","○","○","○","○","○","○","○","○","○","○","○","○","○","○","","○","","○","","○","","○","","○","","○","","○","","○","","○","","○","","○","","○","","○","","○","","○","","○","","○","","○","○","○","○","○","○","○","○","○","○","○","○","○","○","○","○","○","○","○","○","○","○","○","○","○","○","○","○","○","○","○","○","○","○","○","○","○","○","○","○","○","○","○","○","○","○","○","○","○","○","○","○","○","○","○","○","○","○","○","○","○","○","○","○","○","○","○","○","○","○","○","○","○","○","○","○","○","○","○","○","○","○","○","○","○","○","○","○","○","○","○","○","○","○","○","○","○","○","○","○","○","○","○","○","○","○","○","○","○","○","○","○","○","○","○","○","○","○","○","○","○","○","○","○","○","○","○","○","○","○","○","○","○","○","○","○","○","○","○","○","○","○","○","○","○","○","○","○","○","○","○","○","○","○","○","○","○","○","○","○","○","○","○","○","○","○","○","○","○","○","○","○","×","○","○","○","○","○","○","○","○","○","○","×","○","○","○","○","○","○","○","○","○","○","○","○","○","○","○","○","×","○","○","○","○","○","○","○","○","○","○","○","○","○","○","×","○","○","○","○","○","○","○","○","○","○","○","○","○","×","○","○","○","○","○","○","○","○","○","○","○","○","○","○","○","○","×","○","○","○","○","○","○","○","○","○","○","○","○","○","○","×","○","○","○","○","○","○","○","○","○","○","○","○","○","○","○","○","×","○","○","○","○","○","○","○","○","○","○","○","○","○","○","×","○","○","○","○","○","○","○","○","○","○","○","○","○","○","○","○","×","○","○","○","○","○","○","○","○","○","○","○","○","○","○","○","○","×","○","○","○","○","○","○","○","○","○","○","○","○","○","○","○","○","×","○","○","○","○","○","○","○","○","○","○","○","○","○","○","×","○","○","○","○","○","○","○","○","○","○","○","○","○","○","○","○","×","○","○","○","○","○","○","○","○","○","○","○","○","○","○","○","○","○","×","○","○","○","○","○","×","○","○","○","○","○","○","×","○","○","○","○","○","○","○","○","○","○","○","○","○","○","○","○","×","○","○","○","○","○","○","○","○","○","○","○","○","○","○","○","○","○","○","○","○","×","○","○","○","○","○","○","○","○","×","○",null,"A",null,null,null,null,null,"ｸﾞﾙｰﾌﾟ宛先登録","複数個の短縮宛先番号を登録(本体メモリに保存される)することができる。同報送信を行う際に使用する。",null,null,null,null,"","","","","",null,null,null,null,"Group address registration  ","Allows registration of (stored in memory of main unit) multiple address book number. This is used for broadcasting. (Group destination transmission)"]
[37,null,null,"○","○","○","○","○","○","○","○","○","○","○","○","○","○","○","○","○","○","○","○","○","○","○","○","○","○","○","○","○","○","○","○","○","○","○","○","○","○","○","○","○","○","○","○","○","○","○","○","○","○","○","○","○","○","○","○","○","○","○","○","○","○","○","○","○","○","○","○","○","○","○","○","○","○","○","○","○","○","○","○","○","○","○","○","○","○","○","○","○","○","○","○","○","○","○","○","○","","○","","○","","○","","○","","○","","○","","○","","○","","○","","○","","○","","○","","○","","○","","○","","○","","○","","○","○","○","○","○","○","○","○","○","○","○","○","○","○","○","○","○","○","○","○","○","○","○","○","○","○","○","○","○","○","○","○","○","○","○","○","○","○","○","○","○","○","○","○","○","○","○","○","○","○","○","○","○","○","○","○","○","○","○","○","○","○","○","○","○","○","○","○","○","○","○","○","○","○","○","○","○","○","○","○","○","○","○","○","○","○","○","○","○","○","○","○","○","○","○","○","○","○","○","○","○","○","○","○","○","○","○","○","○","○","○","○","○","○","○","○","○","○","○","○","○","○","○","○","○","○","○","○","○","○","○","○","○","○","○","○","○","○","○","○","○","○","○","○","○","○","○","○","○","○","○","○","○","○","○","○","○","○","○","○","○","○","○","○","○","○","○","○","○","○","○","○","×","○","○","○","○","○","○","○","○","○","○","×","○","○","○","○","○","○","○","○","○","○","○","○","○","○","○","○","×","○","○","○","○","○","○","○","○","○","○","○","○","○","○","×","○","○","○","○","○","○","○","○","○","○","○","○","○","×","○","○","○","○","○","○","○","○","○","○","○","○","○","○","○","○","×","○","○","○","○","○","○","○","○","○","○","○","○","○","○","×","○","○","○","○","○","○","○","○","○","○","○","○","○","○","○","○","×","○","○","○","○","○","○","○","○","○","○","○","○","○","○","×","○","○","○","○","○","○","○","○","○","○","○","○","○","○","○","○","×","○","○","○","○","○","○","○","○","○","○","○","○","○","○","○","○","×","○","○","○","○","○","○","○","○","○","○","○","○","○","○","○","○","×","○","○","○","○","○","○","○","○","○","○","○","○","○","○","×","○","○","○","○","○","○","○","○","○","○","○","○","○","○","○","○","×","○","○","○","○","○","○","○","○","○","○","○","○","○","○","○","○","○","×","○","○","○","○","○","×","○","○","○","○","○","○","×","○","○","○","○","○","○","○","○","○","○","○","○","○","○","○","○","×","○","○","○","○","○","○","○","○","○","○","○","○","○","○","○","○","○","○","○","○","×","○","○","○","○","○","○","○","○","×","○",null,"A",null,null,null,null,null,"ﾌﾟﾛｸﾞﾗﾑｷｰ登録","宛先情報とスキャンモード情報の登録(本体メモリに保存される)ができる。",null,null,null,null,"","","","","",null,null,null,null,"Program key registration ","Destination and scan mode information can be registered. (stored in memory on the main unit)  "]
[38,null,null,"○","○","○","○","○","○","○","○","○","○","○","○","○","○","○","○","○","○","○","○","○","○","○","○","○","○","○","○","○","○","○","○","○","○","○","○","○","○","○","○","○","○","○","○","○","○","○","○","○","○","○","○","○","○","○","○","○","○","○","○","○","○","○","○","○","○","○","○","○","○","○","○","○","○","○","○","○","○","○","○","○","○","○","○","○","○","○","○","○","○","○","○","○","○","○","○","○","","○","","○","","○","","○","","○","","○","","○","","○","","○","","○","","○","","○","","○","","○","","○","","○","","○","","○","○","○","○","○","○","○","○","○","○","○","○","○","○","○","○","○","○","○","○","○","○","○","○","○","○","○","○","○","○","○","○","○","○","○","○","○","○","○","○","○","○","○","○","○","○","○","○","○","○","○","○","○","○","○","○","○","○","○","○","○","○","○","○","○","○","○","○","○","○","○","○","○","○","○","○","○","○","○","○","○","○","○","○","○","○","○","○","○","○","○","○","○","○","○","○","○","○","○","○","○","○","○","○","○","○","○","○","○","○","○","○","○","○","○","○","○","○","○","○","○","○","○","○","○","○","○","○","○","○","○","○","○","○","○","○","○","○","○","○","○","○","○","○","○","○","○","○","○","○","○","○","○","○","○","○","○","○","○","○","○","○","○","○","○","○","○","○","○","○","○","○","×","○","○","○","○","○","○","○","○","○","○","×","○","○","○","○","○","○","○","○","○","○","○","○","○","○","○","○","×","○","○","○","○","○","○","○","○","○","○","○","○","○","○","×","○","○","○","○","○","○","○","○","○","○","○","○","○","×","○","○","○","○","○","○","○","○","○","○","○","○","○","○","○","○","×","○","○","○","○","○","○","○","○","○","○","○","○","○","○","×","○","○","○","○","○","○","○","○","○","○","○","○","○","○","○","○","×","○","○","○","○","○","○","○","○","○","○","○","○","○","○","×","○","○","○","○","○","○","○","○","○","○","○","○","○","○","○","○","×","○","○","○","○","○","○","○","○","○","○","○","○","○","○","○","○","×","○","○","○","○","○","○","○","○","○","○","○","○","○","○","○","○","×","○","○","○","○","○","○","○","○","○","○","○","○","○","○","×","○","○","○","○","○","○","○","○","○","○","○","○","○","○","○","○","×","○","○","○","○","○","○","○","○","○","○","○","○","○","○","○","○","○","×","○","○","○","○","○","×","○","○","○","○","○","○","×","○","○","○","○","○","○","○","○","○","○","○","○","○","○","○","○","×","○","○","○","○","○","○","○","○","○","○","○","○","○","○","○","○","○","○","○","○","×","○","○","○","○","○","○","○","○","×","○",null,"A",null,null,null,null,null,"アドレス検索","本体パネル上でﾊﾟﾈﾙ、PSL, LDAP等から登録したアドレス一覧より、送信先を検索し、設定する",null,null,null,null,"","","","","",null,null,null,null,"Address search","Searching for destination and set  from address list registered on the panel, PSL or LDAP of the main unit panel. "]
[39,null,null,"○","○","○","○","○","○","○","○","○","○","○","○","○","○","○","○","○","○","○","○","○","○","○","○","○","○","○","○","○","○","○","○","○","○","○","○","○","○","○","○","○","○","○","○","○","○","○","○","○","○","○","○","○","○","○","○","○","○","○","○","○","○","○","○","○","○","○","○","○","○","○","○","○","○","○","○","○","○","○","○","○","○","○","○","○","○","○","○","○","○","○","○","○","○","○","○","○","","○","","○","","○","","○","","○","","○","","○","","○","","○","","○","","○","","○","","○","","○","","○","","○","","○","","○","○","○","○","○","○","○","○","○","○","○","○","○","○","○","○","○","○","○","○","○","○","○","○","○","○","○","○","○","○","○","○","○","○","○","○","○","○","○","○","○","○","○","○","○","○","○","○","○","○","○","○","○","○","○","○","○","○","○","○","○","○","○","○","○","○","○","○","○","○","○","○","○","○","○","○","○","○","○","○","○","○","○","○","○","○","○","○","○","○","○","○","○","○","○","○","○","○","○","○","○","○","○","○","○","○","○","○","○","○","○","○","○","○","○","○","○","○","○","○","○","○","○","○","○","○","○","○","○","○","○","○","○","○","○","○","○","○","○","○","○","○","○","○","○","○","○","○","○","○","○","○","○","○","○","○","○","○","○","○","○","○","○","○","○","○","○","○","○","○","○","○","×","○","○","○","○","○","○","○","○","○","○","×","○","○","○","○","○","○","○","○","○","○","○","○","○","○","○","○","×","○","○","○","○","○","○","○","○","○","○","○","○","○","○","×","○","○","○","○","○","○","○","○","○","○","○","○","○","×","○","○","○","○","○","○","○","○","○","○","○","○","○","○","○","○","×","○","○","○","○","○","○","○","○","○","○","○","○","○","○","×","○","○","○","○","○","○","○","○","○","○","○","○","○","○","○","○","×","○","○","○","○","○","○","○","○","○","○","○","○","○","○","×","○","○","○","○","○","○","○","○","○","○","○","○","○","○","○","○","×","○","○","○","○","○","○","○","○","○","○","○","○","○","○","○","○","×","○","○","○","○","○","○","○","○","○","○","○","○","○","○","○","○","×","○","○","○","○","○","○","○","○","○","○","○","○","○","○","×","○","○","○","○","○","○","○","○","○","○","○","○","○","○","○","○","×","○","○","○","○","○","○","○","○","○","○","○","○","○","○","○","○","○","×","○","○","○","○","○","×","○","○","○","○","○","○","×","○","○","○","○","○","○","○","○","○","○","○","○","○","○","○","○","×","○","○","○","○","○","○","○","○","○","○","○","○","○","○","○","○","○","○","○","○","×","○","○","○","○","○","○","○","○","×","○",null,"A",null,null,null,null,null,"短縮宛先の呼び出し","ﾊﾟﾈﾙ、PSL等から登録した短縮宛先(本体メモリに保存される)を選択する",null,null,null,null,"","","","","",null,null,null,null,"Recall of address book","Shall select address book (stored in memory of the main unit) registered on the panel or PSL ."]
[40,null,null,"○","○","○","○","○","○","○","○","○","○","○","○","○","○","○","○","○","○","○","○","○","○","○","○","○","○","○","○","○","○","○","○","○","○","○","○","○","○","○","○","○","○","○","○","○","○","○","○","○","○","○","○","○","○","○","○","○","○","○","○","○","○","○","○","○","○","○","○","○","○","○","○","○","○","○","○","○","○","○","○","○","○","○","○","○","○","○","○","○","○","○","○","○","○","○","○","○","","○","","○","","○","","○","","○","","○","","○","","○","","○","","○","","○","","○","","○","","○","","○","","○","","○","","○","○","○","○","○","○","○","○","○","○","○","○","○","○","○","○","○","○","○","○","○","○","○","○","○","○","○","○","○","○","○","○","○","○","○","○","○","○","○","○","○","○","○","○","○","○","○","○","○","○","○","○","○","○","○","○","○","○","○","○","○","○","○","○","○","○","○","○","○","○","○","○","○","○","○","○","○","○","○","○","○","○","○","○","○","○","○","○","○","○","○","○","○","○","○","○","○","○","○","○","○","○","○","○","○","○","○","○","○","○","○","○","○","○","○","○","○","○","○","○","○","○","○","○","○","○","○","○","○","○","○","○","○","○","○","○","○","○","○","○","○","○","○","○","○","○","○","○","○","○","○","○","○","○","○","○","○","○","○","○","○","○","○","○","○","○","○","○","○","○","○","○","×","○","○","○","○","○","○","○","○","○","○","×","○","○","○","○","○","○","○","○","○","○","○","○","○","○","○","○","×","○","○","○","○","○","○","○","○","○","○","○","○","○","○","×","○","○","○","○","○","○","○","○","○","○","○","○","○","×","○","○","○","○","○","○","○","○","○","○","○","○","○","○","○","○","×","○","○","○","○","○","○","○","○","○","○","○","○","○","○","×","○","○","○","○","○","○","○","○","○","○","○","○","○","○","○","○","×","○","○","○","○","○","○","○","○","○","○","○","○","○","○","×","○","○","○","○","○","○","○","○","○","○","○","○","○","○","○","○","×","○","○","○","○","○","○","○","○","○","○","○","○","○","○","○","○","×","○","○","○","○","○","○","○","○","○","○","○","○","○","○","○","○","×","○","○","○","○","○","○","○","○","○","○","○","○","○","○","×","○","○","○","○","○","○","○","○","○","○","○","○","○","○","○","○","×","○","○","○","○","○","○","○","○","○","○","○","○","○","○","○","○","○","×","○","○","○","○","○","×","○","○","○","○","○","○","×","○","○","○","○","○","○","○","○","○","○","○","○","○","○","○","○","×","○","○","○","○","○","○","○","○","○","○","○","○","○","○","○","○","○","○","○","○","×","○","○","○","○","○","○","○","○","×","○",null,"A",null,null,null,null,null,"ｸﾞﾙｰﾌﾟ宛先の呼び出し","ﾊﾟﾈﾙ、PSL等から登録したグループ宛先(本体メモリに保存される)を選択する",null,null,null,null,"","","","","",null,null,null,null,"Recall of group address ","Shall select a group address (stored in memory of the main unit) registered on the panel or PSL ."]
[41,null,null,"○","○","○","○","○","○","○","○","○","○","○","○","○","○","○","○","○","○","○","○","○","○","○","○","○","○","○","○","○","○","○","○","○","○","○","○","○","○","○","○","○","○","○","○","○","○","○","○","○","○","○","○","○","○","○","○","○","○","○","○","○","○","○","○","○","○","○","○","○","○","○","○","○","○","○","○","○","○","○","○","○","○","○","○","○","○","○","○","○","○","○","○","○","○","○","○","○","","○","","○","","○","","○","","○","","○","","○","","○","","○","","○","","○","","○","","○","","○","","○","","○","","○","","○","○","○","○","○","○","○","○","○","○","○","○","○","○","○","○","○","○","○","○","○","○","○","○","○","○","○","○","○","○","○","○","○","○","○","○","○","○","○","○","○","○","○","○","○","○","○","○","○","○","○","○","○","○","○","○","○","○","○","○","○","○","○","○","○","○","○","○","○","○","○","○","○","○","○","○","○","○","○","○","○","○","○","○","○","○","○","○","○","○","○","○","○","○","○","○","○","○","○","○","○","○","○","○","○","○","○","○","○","○","○","○","○","○","○","○","○","○","○","○","○","○","○","○","○","○","○","○","○","○","○","○","○","○","○","○","○","○","○","○","○","○","○","○","○","○","○","○","○","○","○","○","○","○","○","○","○","○","○","○","○","○","○","○","○","○","○","○","○","○","○","○","×","○","○","○","○","○","○","○","○","○","○","×","○","○","○","○","○","○","○","○","○","○","○","○","○","○","○","○","×","○","○","○","○","○","○","○","○","○","○","○","○","○","○","×","○","○","○","○","○","○","○","○","○","○","○","○","○","×","○","○","○","○","○","○","○","○","○","○","○","○","○","○","○","○","×","○","○","○","○","○","○","○","○","○","○","○","○","○","○","×","○","○","○","○","○","○","○","○","○","○","○","○","○","○","○","○","×","○","○","○","○","○","○","○","○","○","○","○","○","○","○","×","○","○","○","○","○","○","○","○","○","○","○","○","○","○","○","○","×","○","○","○","○","○","○","○","○","○","○","○","○","○","○","○","○","×","○","○","○","○","○","○","○","○","○","○","○","○","○","○","○","○","×","○","○","○","○","○","○","○","○","○","○","○","○","○","○","×","○","○","○","○","○","○","○","○","○","○","○","○","○","○","○","○","×","○","○","○","○","○","○","○","○","○","○","○","○","○","○","○","○","○","×","○","○","○","○","○","×","○","○","○","○","○","○","×","○","○","○","○","○","○","○","○","○","○","○","○","○","○","○","○","×","○","○","○","○","○","○","○","○","○","○","○","○","○","○","○","○","○","○","○","○","×","○","○","○","○","○","○","○","○","×","○",null,"A",null,null,null,null,null,"ﾌﾟﾛｸﾞﾗﾑｷｰの呼び出し","ﾊﾟﾈﾙ、PSL等から登録したプログラムキー(本体メモリに保存される)を選択する",null,null,null,null,"","","","","",null,null,null,null,"Recall of program key","Shall select a program key  (stored in memory on the main unit) registered on the panel or PSL .\n"]
[42,null,null,"○","○","○","○","○","○","○","○","○","○","○","○","○","○","○","○","○","○","○","○","○","○","○","○","○","○","○","○","○","○","○","○","○","○","○","○","○","○","○","○","○","○","○","○","○","○","○","○","○","○","○","○","○","○","○","○","○","○","○","○","○","○","○","○","○","○","○","○","○","○","○","○","○","○","○","○","○","○","○","○","○","○","○","○","○","○","○","○","○","○","○","○","○","○","○","○","○","","○","","○","","○","","○","","○","","○","","○","","○","","○","","○","","○","","○","","○","","○","","○","","○","","○","","○","○","○","○","○","○","○","○","○","○","○","○","○","○","○","○","○","○","○","○","○","○","○","○","○","○","○","○","○","○","○","○","○","○","○","○","○","○","○","○","○","○","○","○","○","○","○","○","○","○","○","○","○","○","○","○","○","○","○","○","○","○","○","○","○","○","○","○","○","○","○","○","○","○","○","○","○","○","○","○","○","○","○","○","○","○","○","○","○","○","○","○","○","○","○","○","○","○","○","○","○","○","○","○","○","○","○","○","○","○","○","○","○","○","○","○","○","○","○","○","○","○","○","○","○","○","○","○","○","○","○","○","○","○","○","○","○","○","○","○","○","○","○","○","○","○","○","○","○","○","○","○","○","○","○","○","○","○","○","○","○","○","○","○","○","○","○","○","○","○","○","○","×","○","○","○","○","○","○","○","○","○","○","×","○","○","○","○","○","○","○","○","○","○","○","○","○","○","○","○","×","○","○","○","○","○","○","○","○","○","○","○","○","○","○","×","○","○","○","○","○","○","○","○","○","○","○","○","○","×","○","○","○","○","○","○","○","○","○","○","○","○","○","○","○","○","×","○","○","○","○","○","○","○","○","○","○","○","○","○","○","×","○","○","○","○","○","○","○","○","○","○","○","○","○","○","○","○","×","○","○","○","○","○","○","○","○","○","○","○","○","○","○","×","○","○","○","○","○","○","○","○","○","○","○","○","○","○","○","○","×","○","○","○","○","○","○","○","○","○","○","○","○","○","○","○","○","×","○","○","○","○","○","○","○","○","○","○","○","○","○","○","○","○","×","○","○","○","○","○","○","○","○","○","○","○","○","○","○","×","○","○","○","○","○","○","○","○","○","○","○","○","○","○","○","○","×","○","○","○","○","○","○","○","○","○","○","○","○","○","○","○","○","○","×","○","○","○","○","○","×","○","○","○","○","○","○","×","○","○","○","○","○","○","○","○","○","○","○","○","○","○","○","○","×","○","○","○","○","○","○","○","○","○","○","○","○","○","○","○","○","○","○","○","○","×","○","○","○","○","○","○","○","○","×","○",null,"A",null,null,null,null,null,"一時配信設定登録の呼び出し","PSL等から登録した一時配信設定登録(1回しか呼び出せず、本体電源切断で失われる)を選択する",null,null,null,null,"","","","","",null,null,null,null,"Recall of a temporary one-touch setting registration ","Shall select a temporary one-touch setting registration that is registered on PSL (only one time recall, and be lost after disconnecting the power supply of the main unit) "]
[43,null,null,"○","○","○","○","○","○","○","○","○","○","○","○","○","○","○","○","○","○","○","○","○","○","○","○","○","○","○","○","○","○","○","○","○","○","○","○","○","○","○","○","○","○","○","○","○","○","○","○","○","○","○","○","○","○","○","○","○","○","○","○","○","○","○","○","○","○","○","○","○","○","○","○","○","○","○","○","○","○","○","○","○","○","○","○","○","○","○","○","○","○","○","○","○","○","○","○","○","","○","","○","","○","","○","","○","","○","","○","","○","","○","","○","","○","","○","","○","","○","","○","","○","","○","","○","○","○","○","○","○","○","○","○","○","○","○","○","○","○","○","○","○","○","○","○","○","○","○","○","○","○","○","○","○","○","○","○","○","○","○","○","○","○","○","○","○","○","○","○","○","○","○","○","○","○","○","○","○","○","○","○","○","○","○","○","○","○","○","○","○","○","○","○","○","○","○","○","○","○","○","○","○","○","○","○","○","○","○","○","○","○","○","○","○","○","○","○","○","○","○","○","○","○","○","○","○","○","○","○","○","○","○","○","○","○","○","○","○","○","○","○","○","○","○","○","○","○","○","○","○","○","○","○","○","○","○","○","○","○","○","○","○","○","○","○","○","○","○","○","○","○","○","○","○","○","○","○","○","○","○","○","○","○","○","○","○","○","○","○","○","○","○","○","○","○","○","×","○","○","○","○","○","○","○","○","○","○","×","○","○","○","○","○","○","○","○","○","○","○","○","○","○","○","○","×","○","○","○","○","○","○","○","○","○","○","○","○","○","○","×","○","○","○","○","○","○","○","○","○","○","○","○","○","×","○","○","○","○","○","○","○","○","○","○","○","○","○","○","○","○","×","○","○","○","○","○","○","○","○","○","○","○","○","○","○","×","○","○","○","○","○","○","○","○","○","○","○","○","○","○","○","○","×","○","○","○","○","○","○","○","○","○","○","○","○","○","○","×","○","○","○","○","○","○","○","○","○","○","○","○","○","○","○","○","×","○","○","○","○","○","○","○","○","○","○","○","○","○","○","○","○","×","○","○","○","○","○","○","○","○","○","○","○","○","○","○","○","○","×","○","○","○","○","○","○","○","○","○","○","○","○","○","○","×","○","○","○","○","○","○","○","○","○","○","○","○","○","○","○","○","×","○","○","○","○","○","○","○","○","○","○","○","○","○","○","○","○","○","×","○","○","○","○","○","×","○","○","○","○","○","○","×","○","○","○","○","○","○","○","○","○","○","○","○","○","○","○","○","×","○","○","○","○","○","○","○","○","○","○","○","○","○","○","○","○","○","○","○","○","×","○","○","○","○","○","○","○","○","×","○",null,"A",null,null,null,null,null,"スキャン開始・停止・再開・破棄","本体起動のスキャンの開始・停止・再開・破棄を行う",null,null,null,null,"","","","","",null,null,null,null,"Start-up/ suspension / restart /deletion","Performed main unit scan start-up /suspension /re-start / deletion  "]
[44,null,null,"○","○","○","○","○","○","○","○","○","○","○","○","○","○","○","○","○","○","○","○","○","○","○","○","○","○","○","○","○","○","○","○","○","○","○","○","○","○","○","○","○","○","○","○","○","○","○","○","○","○","○","○","○","○","○","○","○","○","○","○","○","○","○","○","○","○","○","○","○","○","○","○","○","○","○","○","○","○","○","○","○","○","○","○","○","○","○","○","○","○","○","○","○","○","○","○","○","","○","","○","","○","","○","","○","","○","","○","","○","","○","","○","","○","","○","","○","","○","","○","","○","","○","","○","○","○","○","○","○","○","○","○","○","○","○","○","○","○","○","○","○","○","○","○","○","○","○","○","○","○","○","○","○","○","○","○","○","○","○","○","○","○","○","○","○","○","○","○","○","○","○","○","○","○","○","○","○","○","○","○","○","○","○","○","○","○","○","○","○","○","○","○","○","○","○","○","○","○","○","○","○","○","○","○","○","○","○","○","○","○","○","○","○","○","○","○","○","○","○","○","○","○","○","○","○","○","○","○","○","○","○","○","○","○","○","○","○","○","○","○","○","○","○","○","○","○","○","○","○","○","○","○","○","○","○","○","○","○","○","○","○","○","○","○","○","○","○","○","○","○","○","○","○","○","○","○","○","○","○","○","○","○","○","○","○","○","○","○","○","○","○","○","○","○","○","×","○","○","○","○","○","○","○","○","○","○","×","○","○","○","○","○","○","○","○","○","○","○","○","○","○","○","○","×","○","○","○","○","○","○","○","○","○","○","○","○","○","○","×","○","○","○","○","○","○","○","○","○","○","○","○","○","×","○","○","○","○","○","○","○","○","○","○","○","○","○","○","○","○","×","○","○","○","○","○","○","○","○","○","○","○","○","○","○","×","○","○","○","○","○","○","○","○","○","○","○","○","○","○","○","○","×","○","○","○","○","○","○","○","○","○","○","○","○","○","○","×","○","○","○","○","○","○","○","○","○","○","○","○","○","○","○","○","×","○","○","○","○","○","○","○","○","○","○","○","○","○","○","○","○","×","○","○","○","○","○","○","○","○","○","○","○","○","○","○","○","○","×","○","○","○","○","○","○","○","○","○","○","○","○","○","○","×","○","○","○","○","○","○","○","○","○","○","○","○","○","○","○","○","×","○","○","○","○","○","○","○","○","○","○","○","○","○","○","○","○","○","×","○","○","○","○","○","×","○","○","○","○","○","○","×","○","○","○","○","○","○","○","○","○","○","○","○","○","○","○","○","×","○","○","○","○","○","○","○","○","○","○","○","○","○","○","○","○","○","○","○","○","×","○","○","○","○","○","○","○","○","×","○",null,"A",null,null,null,null,null,"ネットワーク管理情報入力","ネットワーク関連の管理情報(IPアドレス・サブネットマスク等)を設定・表示する",null,null,null,null,"","","","","",null,null,null,null,"Information entry for network management","Shall set or display of management information related to the network (IP address and subnet mask). "]
[45,null,null,"○","○","○","○","○","○","○","○","○","○","○","○","○","○","○","○","○","○","○","○","○","○","○","○","○","○","○","○","○","○","○","○","○","○","○","○","○","○","○","○","○","○","○","○","○","○","○","○","○","○","○","○","○","○","○","○","○","○","○","○","○","○","○","○","○","○","○","○","○","○","○","○","○","○","○","○","○","○","○","○","○","○","○","○","○","○","○","○","○","○","○","○","○","○","○","○","○","","○","","○","","○","","○","","○","","○","","○","","○","","○","","○","","○","","○","","○","","○","","○","","○","","○","","○","○","○","○","○","○","○","○","○","○","○","○","○","○","○","○","○","○","○","○","○","○","○","○","○","○","○","○","○","○","○","○","○","○","○","○","○","○","○","○","○","○","○","○","○","○","○","○","○","○","○","○","○","○","○","○","○","○","○","○","○","○","○","○","○","○","○","○","○","○","○","○","○","○","○","○","○","○","○","○","○","○","○","○","○","○","○","○","○","○","○","○","○","○","○","○","○","○","○","○","○","○","○","○","○","○","○","○","○","○","○","○","○","○","○","○","○","○","○","○","○","○","○","○","○","○","○","○","○","○","○","○","○","○","○","○","○","○","○","○","○","○","○","○","○","○","○","○","○","○","○","○","○","○","○","○","○","○","○","○","○","○","○","○","○","○","○","○","○","○","○","○","×","○","○","○","○","○","○","○","○","○","○","×","○","○","○","○","○","○","○","○","○","○","○","○","○","○","○","○","×","○","○","○","○","○","○","○","○","○","○","○","○","○","○","×","○","○","○","○","○","○","○","○","○","○","○","○","○","×","○","○","○","○","○","○","○","○","○","○","○","○","○","○","○","○","×","○","○","○","○","○","○","○","○","○","○","○","○","○","○","×","○","○","○","○","○","○","○","○","○","○","○","○","○","○","○","○","×","○","○","○","○","○","○","○","○","○","○","○","○","○","○","×","○","○","○","○","○","○","○","○","○","○","○","○","○","○","○","○","×","○","○","○","○","○","○","○","○","○","○","○","○","○","○","○","○","×","○","○","○","○","○","○","○","○","○","○","○","○","○","○","○","○","×","○","○","○","○","○","○","○","○","○","○","○","○","○","○","×","○","○","○","○","○","○","○","○","○","○","○","○","○","○","○","○","×","○","○","○","○","○","○","○","○","○","○","○","○","○","○","○","○","○","×","○","○","○","○","○","×","○","○","○","○","○","○","×","○","○","○","○","○","○","○","○","○","○","○","○","○","○","○","○","×","○","○","○","○","○","○","○","○","○","○","○","○","○","○","○","○","○","○","○","○","×","○","○","○","○","○","○","○","○","×","○",null,"A",null,null,null,null,"2) PSL等から","短縮宛先登録","短縮宛先として配信設定を登録する",null,null,null,null,"","","","","",null,null,null,"2) From PSL ","Address book registration ","Shall register transmission settings as a address book."]
[46,null,null,"○","○","○","○","○","○","○","○","○","○","○","○","○","○","○","○","○","○","○","○","○","○","○","○","○","○","○","○","○","○","○","○","○","○","○","○","○","○","○","○","○","○","○","○","○","○","○","○","○","○","○","○","○","○","○","○","○","○","○","○","○","○","○","○","○","○","○","○","○","○","○","○","○","○","○","○","○","○","○","○","○","○","○","○","○","○","○","○","○","○","○","○","○","○","○","○","○","","○","","○","","○","","○","","○","","○","","○","","○","","○","","○","","○","","○","","○","","○","","○","","○","","○","","○","○","○","○","○","○","○","○","○","○","○","○","○","○","○","○","○","○","○","○","○","○","○","○","○","○","○","○","○","○","○","○","○","○","○","○","○","○","○","○","○","○","○","○","○","○","○","○","○","○","○","○","○","○","○","○","○","○","○","○","○","○","○","○","○","○","○","○","○","○","○","○","○","○","○","○","○","○","○","○","○","○","○","○","○","○","○","○","○","○","○","○","○","○","○","○","○","○","○","○","○","○","○","○","○","○","○","○","○","○","○","○","○","○","○","○","○","○","○","○","○","○","○","○","○","○","○","○","○","○","○","○","○","○","○","○","○","○","○","○","○","○","○","○","○","○","○","○","○","○","○","○","○","○","○","○","○","○","○","○","○","○","○","○","○","○","○","○","○","○","○","○","×","○","○","○","○","○","○","○","○","○","○","×","○","○","○","○","○","○","○","○","○","○","○","○","○","○","○","○","×","○","○","○","○","○","○","○","○","○","○","○","○","○","○","×","○","○","○","○","○","○","○","○","○","○","○","○","○","×","○","○","○","○","○","○","○","○","○","○","○","○","○","○","○","○","×","○","○","○","○","○","○","○","○","○","○","○","○","○","○","×","○","○","○","○","○","○","○","○","○","○","○","○","○","○","○","○","×","○","○","○","○","○","○","○","○","○","○","○","○","○","○","×","○","○","○","○","○","○","○","○","○","○","○","○","○","○","○","○","×","○","○","○","○","○","○","○","○","○","○","○","○","○","○","○","○","×","○","○","○","○","○","○","○","○","○","○","○","○","○","○","○","○","×","○","○","○","○","○","○","○","○","○","○","○","○","○","○","×","○","○","○","○","○","○","○","○","○","○","○","○","○","○","○","○","×","○","○","○","○","○","○","○","○","○","○","○","○","○","○","○","○","○","×","○","○","○","○","○","×","○","○","○","○","○","○","×","○","○","○","○","○","○","○","○","○","○","○","○","○","○","○","○","×","○","○","○","○","○","○","○","○","○","○","○","○","○","○","○","○","○","○","○","○","×","○","○","○","○","○","○","○","○","×","○",null,"A",null,null,null,null,null,"ｸﾞﾙｰﾌﾟ宛先登録","グループ宛先として複数個の短縮宛先番号を登録する\n",null,null,null,null,"","","","","",null,null,null,null,"Group address registration  ","Shall register a multiple address book numbers as a group destination.  \n"]
[47,null,null,"○","○","○","○","○","○","○","○","○","○","○","○","○","○","○","○","○","○","○","○","○","○","○","○","○","○","○","○","○","○","○","○","○","○","○","○","○","○","○","○","○","○","○","○","○","○","○","○","○","○","○","○","○","○","○","○","○","○","○","○","○","○","○","○","○","○","○","○","○","○","○","○","○","○","○","○","○","○","○","○","○","○","○","○","○","○","○","○","○","○","○","○","○","○","○","○","○","","○","","○","","○","","○","","○","","○","","○","","○","","○","","○","","○","","○","","○","","○","","○","","○","","○","","○","○","○","○","○","○","○","○","○","○","○","○","○","○","○","○","○","○","○","○","○","○","○","○","○","○","○","○","○","○","○","○","○","○","○","○","○","○","○","○","○","○","○","○","○","○","○","○","○","○","○","○","○","○","○","○","○","○","○","○","○","○","○","○","○","○","○","○","○","○","○","○","○","○","○","○","○","○","○","○","○","○","○","○","○","○","○","○","○","○","○","○","○","○","○","○","○","○","○","○","○","○","○","○","○","○","○","○","○","○","○","○","○","○","○","○","○","○","○","○","○","○","○","○","○","○","○","○","○","○","○","○","○","○","○","○","○","○","○","○","○","○","○","○","○","○","○","○","○","○","○","○","○","○","○","○","○","○","○","○","○","○","○","○","○","○","○","○","○","○","○","○","×","○","○","○","○","○","○","○","○","○","○","×","○","○","○","○","○","○","○","○","○","○","○","○","○","○","○","○","×","○","○","○","○","○","○","○","○","○","○","○","○","○","○","×","○","○","○","○","○","○","○","○","○","○","○","○","○","×","○","○","○","○","○","○","○","○","○","○","○","○","○","○","○","○","×","○","○","○","○","○","○","○","○","○","○","○","○","○","○","×","○","○","○","○","○","○","○","○","○","○","○","○","○","○","○","○","×","○","○","○","○","○","○","○","○","○","○","○","○","○","○","×","○","○","○","○","○","○","○","○","○","○","○","○","○","○","○","○","×","○","○","○","○","○","○","○","○","○","○","○","○","○","○","○","○","×","○","○","○","○","○","○","○","○","○","○","○","○","○","○","○","○","×","○","○","○","○","○","○","○","○","○","○","○","○","○","○","×","○","○","○","○","○","○","○","○","○","○","○","○","○","○","○","○","×","○","○","○","○","○","○","○","○","○","○","○","○","○","○","○","○","○","×","○","○","○","○","○","×","○","○","○","○","○","○","×","○","○","○","○","○","○","○","○","○","○","○","○","○","○","○","○","×","○","○","○","○","○","○","○","○","○","○","○","○","○","○","○","○","○","○","○","○","×","○","○","○","○","○","○","○","○","×","○",null,"A",null,null,null,null,null,"ﾌﾟﾛｸﾞﾗﾑｷｰ登録","プログラムキーとしてスキャンモードと配信設定を登録する",null,null,null,null,"","","","","",null,null,null,null,"Program key registration ","Registers scan mode and transmission settings as a program key.\n"]
[48,null,null,"○","○","○","○","○","○","○","○","○","○","○","○","○","○","○","○","○","○","○","○","○","○","○","○","○","○","○","○","○","○","○","○","○","○","○","○","○","○","○","○","○","○","○","○","○","○","○","○","○","○","○","○","○","○","○","○","○","○","○","○","○","○","○","○","○","○","○","○","○","○","○","○","○","○","○","○","○","○","○","○","○","○","○","○","○","○","○","○","○","○","○","○","○","○","○","○","○","","○","","○","","○","","○","","○","","○","","○","","○","","○","","○","","○","","○","","○","","○","","○","","○","","○","","○","○","○","○","○","○","○","○","○","○","○","○","○","○","○","○","○","○","○","○","○","○","○","○","○","○","○","○","○","○","○","○","○","○","○","○","○","○","○","○","○","○","○","○","○","○","○","○","○","○","○","○","○","○","○","○","○","○","○","○","○","○","○","○","○","○","○","○","○","○","○","○","○","○","○","○","○","○","○","○","○","○","○","○","○","○","○","○","○","○","○","○","○","○","○","○","○","○","○","○","○","○","○","○","○","○","○","○","○","○","○","○","○","○","○","○","○","○","○","○","○","○","○","○","○","○","○","○","○","○","○","○","○","○","○","○","○","○","○","○","○","○","○","○","○","○","○","○","○","○","○","○","○","○","○","○","○","○","○","○","○","○","○","○","○","○","○","○","○","○","○","○","×","○","○","○","○","○","○","○","○","○","○","×","○","○","○","○","○","○","○","○","○","○","○","○","○","○","○","○","×","○","○","○","○","○","○","○","○","○","○","○","○","○","○","×","○","○","○","○","○","○","○","○","○","○","○","○","○","×","○","○","○","○","○","○","○","○","○","○","○","○","○","○","○","○","×","○","○","○","○","○","○","○","○","○","○","○","○","○","○","×","○","○","○","○","○","○","○","○","○","○","○","○","○","○","○","○","×","○","○","○","○","○","○","○","○","○","○","○","○","○","○","×","○","○","○","○","○","○","○","○","○","○","○","○","○","○","○","○","×","○","○","○","○","○","○","○","○","○","○","○","○","○","○","○","○","×","○","○","○","○","○","○","○","○","○","○","○","○","○","○","○","○","×","○","○","○","○","○","○","○","○","○","○","○","○","○","○","×","○","○","○","○","○","○","○","○","○","○","○","○","○","○","○","○","×","○","○","○","○","○","○","○","○","○","○","○","○","○","○","○","○","○","×","○","○","○","○","○","×","○","○","○","○","○","○","×","○","○","○","○","○","○","○","○","○","○","○","○","○","○","○","○","×","○","○","○","○","○","○","○","○","○","○","○","○","○","○","○","○","○","○","○","○","×","○","○","○","○","○","○","○","○","×","○",null,"A",null,null,null,null,null,"アドレス登録","ＬＤＩＦ形式のアドレスを登録する",null,null,null,null,"","","","","",null,null,null,null,"Address registration ","Registers an address of LDIF format."]
[49,null,null,"○","○","○","○","○","○","○","○","○","○","○","○","○","○","○","○","○","○","○","○","○","○","○","○","○","○","○","○","○","○","○","○","○","○","○","○","○","○","○","○","○","○","○","○","○","○","○","○","○","○","○","○","○","○","○","○","○","○","○","○","○","○","○","○","○","○","○","○","○","○","○","○","○","○","○","○","○","○","○","○","○","○","○","○","○","○","○","○","○","○","○","○","○","○","○","○","○","","○","","○","","○","","○","","○","","○","","○","","○","","○","","○","","○","","○","","○","","○","","○","","○","","○","","○","○","○","○","○","○","○","○","○","○","○","○","○","○","○","○","○","○","○","○","○","○","○","○","○","○","○","○","○","○","○","○","○","○","○","○","○","○","○","○","○","○","○","○","○","○","○","○","○","○","○","○","○","○","○","○","○","○","○","○","○","○","○","○","○","○","○","○","○","○","○","○","○","○","○","○","○","○","○","○","○","○","○","○","○","○","○","○","○","○","○","○","○","○","○","○","○","○","○","○","○","○","○","○","○","○","○","○","○","○","○","○","○","○","○","○","○","○","○","○","○","○","○","○","○","○","○","○","○","○","○","○","○","○","○","○","○","○","○","○","○","○","○","○","○","○","○","○","○","○","○","○","○","○","○","○","○","○","○","○","○","○","○","○","○","○","○","○","○","○","○","○","×","○","○","○","○","○","○","○","○","○","○","×","○","○","○","○","○","○","○","○","○","○","○","○","○","○","○","○","×","○","○","○","○","○","○","○","○","○","○","○","○","○","○","×","○","○","○","○","○","○","○","○","○","○","○","○","○","×","○","○","○","○","○","○","○","○","○","○","○","○","○","○","○","○","×","○","○","○","○","○","○","○","○","○","○","○","○","○","○","×","○","○","○","○","○","○","○","○","○","○","○","○","○","○","○","○","×","○","○","○","○","○","○","○","○","○","○","○","○","○","○","×","○","○","○","○","○","○","○","○","○","○","○","○","○","○","○","○","×","○","○","○","○","○","○","○","○","○","○","○","○","○","○","○","○","×","○","○","○","○","○","○","○","○","○","○","○","○","○","○","○","○","×","○","○","○","○","○","○","○","○","○","○","○","○","○","○","×","○","○","○","○","○","○","○","○","○","○","○","○","○","○","○","○","×","○","○","○","○","○","○","○","○","○","○","○","○","○","○","○","○","○","×","○","○","○","○","○","×","○","○","○","○","○","○","×","○","○","○","○","○","○","○","○","○","○","○","○","○","○","○","○","×","○","○","○","○","○","○","○","○","○","○","○","○","○","○","○","○","○","○","○","○","×","○","○","○","○","○","○","○","○","×","○",null,"A",null,null,null,null,null,"一時配信設定登録","一時配信設定登録としてスキャンモードと配信設定を登録する",null,null,null,null,"","","","","",null,null,null,null,"Temporary one-touch setting registration","Registers scan mode and a transmission setting as a temporary one-touch setting registration.  "]
[50,null,null,"○","○","○","○","○","○","○","○","○","○","○","○","○","○","○","○","○","○","○","○","○","○","○","○","○","○","○","○","○","○","○","○","○","○","○","○","○","○","○","○","○","○","○","○","○","○","○","○","○","○","○","○","○","○","○","○","○","○","○","○","○","○","○","○","○","○","○","○","○","○","○","○","○","○","○","○","○","○","○","○","○","○","○","○","○","○","○","○","○","○","○","○","○","○","○","○","○","","○","","○","","○","","○","","○","","○","","○","","○","","○","","○","","○","","○","","○","","○","","○","","○","","○","","○","○","○","○","○","○","○","○","○","○","○","○","○","○","○","○","○","○","○","○","○","○","○","○","○","○","○","○","○","○","○","○","○","○","○","○","○","○","○","○","○","○","○","○","○","○","○","○","○","○","○","○","○","○","○","○","○","○","○","○","○","○","○","○","○","○","○","○","○","○","○","○","○","○","○","○","○","○","○","○","○","○","○","○","○","○","○","○","○","○","○","○","○","○","○","○","○","○","○","○","○","○","○","○","○","○","○","○","○","○","○","○","○","○","○","○","○","○","○","○","○","○","○","○","○","○","○","○","○","○","○","○","○","○","○","○","○","○","○","○","○","○","○","○","○","○","○","○","○","○","○","○","○","○","○","○","○","○","○","○","○","○","○","○","○","○","○","○","○","○","○","○","×","○","○","○","○","○","○","○","○","○","○","×","○","○","○","○","○","○","○","○","○","○","○","○","○","○","○","○","×","○","○","○","○","○","○","○","○","○","○","○","○","○","○","×","○","○","○","○","○","○","○","○","○","○","○","○","○","×","○","○","○","○","○","○","○","○","○","○","○","○","○","○","○","○","×","○","○","○","○","○","○","○","○","○","○","○","○","○","○","×","○","○","○","○","○","○","○","○","○","○","○","○","○","○","○","○","×","○","○","○","○","○","○","○","○","○","○","○","○","○","○","×","○","○","○","○","○","○","○","○","○","○","○","○","○","○","○","○","×","○","○","○","○","○","○","○","○","○","○","○","○","○","○","○","○","×","○","○","○","○","○","○","○","○","○","○","○","○","○","○","○","○","×","○","○","○","○","○","○","○","○","○","○","○","○","○","○","×","○","○","○","○","○","○","○","○","○","○","○","○","○","○","○","○","×","○","○","○","○","○","○","○","○","○","○","○","○","○","○","○","○","○","×","○","○","○","○","○","×","○","○","○","○","○","○","×","○","○","○","○","○","○","○","○","○","○","○","○","○","○","○","○","×","○","○","○","○","○","○","○","○","○","○","○","○","○","○","○","○","○","○","○","○","×","○","○","○","○","○","○","○","○","×","○",null,"A",null,null,null,null,null,"短縮宛先の呼び出し","ﾊﾟﾈﾙ、PSL等から登録した短縮宛先(本体メモリに保存される)を選択する",null,null,null,null,"","","","","",null,null,null,null,"Recall of address book","Shall select address book (stored in memory of the main unit) registered on the panel or PSL ."]
[51,null,null,"○","○","○","○","○","○","○","○","○","○","○","○","○","○","○","○","○","○","○","○","○","○","○","○","○","○","○","○","○","○","○","○","○","○","○","○","○","○","○","○","○","○","○","○","○","○","○","○","○","○","○","○","○","○","○","○","○","○","○","○","○","○","○","○","○","○","○","○","○","○","○","○","○","○","○","○","○","○","○","○","○","○","○","○","○","○","○","○","○","○","○","○","○","○","○","○","○","","○","","○","","○","","○","","○","","○","","○","","○","","○","","○","","○","","○","","○","","○","","○","","○","","○","","○","○","○","○","○","○","○","○","○","○","○","○","○","○","○","○","○","○","○","○","○","○","○","○","○","○","○","○","○","○","○","○","○","○","○","○","○","○","○","○","○","○","○","○","○","○","○","○","○","○","○","○","○","○","○","○","○","○","○","○","○","○","○","○","○","○","○","○","○","○","○","○","○","○","○","○","○","○","○","○","○","○","○","○","○","○","○","○","○","○","○","○","○","○","○","○","○","○","○","○","○","○","○","○","○","○","○","○","○","○","○","○","○","○","○","○","○","○","○","○","○","○","○","○","○","○","○","○","○","○","○","○","○","○","○","○","○","○","○","○","○","○","○","○","○","○","○","○","○","○","○","○","○","○","○","○","○","○","○","○","○","○","○","○","○","○","○","○","○","○","○","○","×","○","○","○","○","○","○","○","○","○","○","×","○","○","○","○","○","○","○","○","○","○","○","○","○","○","○","○","×","○","○","○","○","○","○","○","○","○","○","○","○","○","○","×","○","○","○","○","○","○","○","○","○","○","○","○","○","×","○","○","○","○","○","○","○","○","○","○","○","○","○","○","○","○","×","○","○","○","○","○","○","○","○","○","○","○","○","○","○","×","○","○","○","○","○","○","○","○","○","○","○","○","○","○","○","○","×","○","○","○","○","○","○","○","○","○","○","○","○","○","○","×","○","○","○","○","○","○","○","○","○","○","○","○","○","○","○","○","×","○","○","○","○","○","○","○","○","○","○","○","○","○","○","○","○","×","○","○","○","○","○","○","○","○","○","○","○","○","○","○","○","○","×","○","○","○","○","○","○","○","○","○","○","○","○","○","○","×","○","○","○","○","○","○","○","○","○","○","○","○","○","○","○","○","×","○","○","○","○","○","○","○","○","○","○","○","○","○","○","○","○","○","×","○","○","○","○","○","×","○","○","○","○","○","○","×","○","○","○","○","○","○","○","○","○","○","○","○","○","○","○","○","×","○","○","○","○","○","○","○","○","○","○","○","○","○","○","○","○","○","○","○","○","×","○","○","○","○","○","○","○","○","×","○",null,"A",null,null,null,null,null,"ｸﾞﾙｰﾌﾟ宛先の呼び出し","ﾊﾟﾈﾙ、PSL等から登録したグループ宛先(本体メモリに保存される)を選択する",null,null,null,null,"","","","","",null,null,null,null,"Recall of group address ","Shall select a group address (stored in memory of the main unit) registered on the panel or PSL ."]
[52,null,null,"○","○","○","○","○","○","○","○","○","○","○","○","○","○","○","○","○","○","○","○","○","○","○","○","○","○","○","○","○","○","○","○","○","○","○","○","○","○","○","○","○","○","○","○","○","○","○","○","○","○","○","○","○","○","○","○","○","○","○","○","○","○","○","○","○","○","○","○","○","○","○","○","○","○","○","○","○","○","○","○","○","○","○","○","○","○","○","○","○","○","○","○","○","○","○","○","○","","○","","○","","○","","○","","○","","○","","○","","○","","○","","○","","○","","○","","○","","○","","○","","○","","○","","○","○","○","○","○","○","○","○","○","○","○","○","○","○","○","○","○","○","○","○","○","○","○","○","○","○","○","○","○","○","○","○","○","○","○","○","○","○","○","○","○","○","○","○","○","○","○","○","○","○","○","○","○","○","○","○","○","○","○","○","○","○","○","○","○","○","○","○","○","○","○","○","○","○","○","○","○","○","○","○","○","○","○","○","○","○","○","○","○","○","○","○","○","○","○","○","○","○","○","○","○","○","○","○","○","○","○","○","○","○","○","○","○","○","○","○","○","○","○","○","○","○","○","○","○","○","○","○","○","○","○","○","○","○","○","○","○","○","○","○","○","○","○","○","○","○","○","○","○","○","○","○","○","○","○","○","○","○","○","○","○","○","○","○","○","○","○","○","○","○","○","○","×","○","○","○","○","○","○","○","○","○","○","×","○","○","○","○","○","○","○","○","○","○","○","○","○","○","○","○","×","○","○","○","○","○","○","○","○","○","○","○","○","○","○","×","○","○","○","○","○","○","○","○","○","○","○","○","○","×","○","○","○","○","○","○","○","○","○","○","○","○","○","○","○","○","×","○","○","○","○","○","○","○","○","○","○","○","○","○","○","×","○","○","○","○","○","○","○","○","○","○","○","○","○","○","○","○","×","○","○","○","○","○","○","○","○","○","○","○","○","○","○","×","○","○","○","○","○","○","○","○","○","○","○","○","○","○","○","○","×","○","○","○","○","○","○","○","○","○","○","○","○","○","○","○","○","×","○","○","○","○","○","○","○","○","○","○","○","○","○","○","○","○","×","○","○","○","○","○","○","○","○","○","○","○","○","○","○","×","○","○","○","○","○","○","○","○","○","○","○","○","○","○","○","○","×","○","○","○","○","○","○","○","○","○","○","○","○","○","○","○","○","○","×","○","○","○","○","○","×","○","○","○","○","○","○","×","○","○","○","○","○","○","○","○","○","○","○","○","○","○","○","○","×","○","○","○","○","○","○","○","○","○","○","○","○","○","○","○","○","○","○","○","○","×","○","○","○","○","○","○","○","○","×","○",null,"A",null,null,null,null,null,"ﾌﾟﾛｸﾞﾗﾑｷｰの呼び出し","ﾊﾟﾈﾙ、PSL等から登録したプログラムキー(本体メモリに保存される)を選択する",null,null,null,null,"","","","","",null,null,null,null,"Recall of program key","Shall select a program key  (stored in memory on the main unit) registered on the panel or PSL .\n"]
[53,null,null,"○","○","○","○","○","○","○","○","○","○","○","○","○","○","○","○","○","○","○","○","○","○","○","○","○","○","○","○","○","○","○","○","○","○","○","○","○","○","○","○","○","○","○","○","○","○","○","○","○","○","○","○","○","○","○","○","○","○","○","○","○","○","○","○","○","○","○","○","○","○","○","○","○","○","○","○","○","○","○","○","○","○","○","○","○","○","○","○","○","○","○","○","○","○","○","○","○","","○","","○","","○","","○","","○","","○","","○","","○","","○","","○","","○","","○","","○","","○","","○","","○","","○","","○","○","○","○","○","○","○","○","○","○","○","○","○","○","○","○","○","○","○","○","○","○","○","○","○","○","○","○","○","○","○","○","○","○","○","○","○","○","○","○","○","○","○","○","○","○","○","○","○","○","○","○","○","○","○","○","○","○","○","○","○","○","○","○","○","○","○","○","○","○","○","○","○","○","○","○","○","○","○","○","○","○","○","○","○","○","○","○","○","○","○","○","○","○","○","○","○","○","○","○","○","○","○","○","○","○","○","○","○","○","○","○","○","○","○","○","○","○","○","○","○","○","○","○","○","○","○","○","○","○","○","○","○","○","○","○","○","○","○","○","○","○","○","○","○","○","○","○","○","○","○","○","○","○","○","○","○","○","○","○","○","○","○","○","○","○","○","○","○","○","○","○","×","○","○","○","○","○","○","○","○","○","○","×","○","○","○","○","○","○","○","○","○","○","○","○","○","○","○","○","×","○","○","○","○","○","○","○","○","○","○","○","○","○","○","×","○","○","○","○","○","○","○","○","○","○","○","○","○","×","○","○","○","○","○","○","○","○","○","○","○","○","○","○","○","○","×","○","○","○","○","○","○","○","○","○","○","○","○","○","○","×","○","○","○","○","○","○","○","○","○","○","○","○","○","○","○","○","×","○","○","○","○","○","○","○","○","○","○","○","○","○","○","×","○","○","○","○","○","○","○","○","○","○","○","○","○","○","○","○","×","○","○","○","○","○","○","○","○","○","○","○","○","○","○","○","○","×","○","○","○","○","○","○","○","○","○","○","○","○","○","○","○","○","×","○","○","○","○","○","○","○","○","○","○","○","○","○","○","×","○","○","○","○","○","○","○","○","○","○","○","○","○","○","○","○","×","○","○","○","○","○","○","○","○","○","○","○","○","○","○","○","○","○","×","○","○","○","○","○","×","○","○","○","○","○","○","×","○","○","○","○","○","○","○","○","○","○","○","○","○","○","○","○","×","○","○","○","○","○","○","○","○","○","○","○","○","○","○","○","○","○","○","○","○","×","○","○","○","○","○","○","○","○","×","○",null,"A",null,null,null,null,null,"一時配信設定登録の呼び出し","PSL等から登録した一時配信設定登録(1回しか呼び出せず、本体電源切断で失われる)を選択する",null,null,null,null,"","","","","",null,null,null,null,"Recall of a temporary one-touch setting registration ","Shall select a temporary one-touch setting registration that is registered on PSL (only one time recall, and be lost after disconnecting the power supply of the main unit) "]
[54,null,null,"○","○","○","○","○","○","○","○","○","○","○","○","○","○","○","○","○","○","○","○","○","○","○","○","○","○","○","○","○","○","○","○","○","○","○","○","○","○","○","○","○","○","○","○","○","○","○","○","○","○","○","○","○","○","○","○","○","○","○","○","○","○","○","○","○","○","○","○","○","○","○","○","○","○","○","○","○","○","○","○","○","○","○","○","○","○","○","○","○","○","○","○","○","○","○","○","○","","○","","○","","○","","○","","○","","○","","○","","○","","○","","○","","○","","○","","○","","○","","○","","○","","○","","○","○","○","○","○","○","○","○","○","○","○","○","○","○","○","○","○","○","○","○","○","○","○","○","○","○","○","○","○","○","○","○","○","○","○","○","○","○","○","○","○","○","○","○","○","○","○","○","○","○","○","○","○","○","○","○","○","○","○","○","○","○","○","○","○","○","○","○","○","○","○","○","○","○","○","○","○","○","○","○","○","○","○","○","○","○","○","○","○","○","○","○","○","○","○","○","○","○","○","○","○","○","○","○","○","○","○","○","○","○","○","○","○","○","○","○","○","○","○","○","○","○","○","○","○","○","○","○","○","○","○","○","○","○","○","○","○","○","○","○","○","○","○","○","○","○","○","○","○","○","○","○","○","○","○","○","○","○","○","○","○","○","○","○","○","○","○","○","○","○","○","○","×","○","○","○","○","○","○","○","○","○","○","×","○","○","○","○","○","○","○","○","○","○","○","○","○","○","○","○","×","○","○","○","○","○","○","○","○","○","○","○","○","○","○","×","○","○","○","○","○","○","○","○","○","○","○","○","○","×","○","○","○","○","○","○","○","○","○","○","○","○","○","○","○","○","×","○","○","○","○","○","○","○","○","○","○","○","○","○","○","×","○","○","○","○","○","○","○","○","○","○","○","○","○","○","○","○","×","○","○","○","○","○","○","○","○","○","○","○","○","○","○","×","○","○","○","○","○","○","○","○","○","○","○","○","○","○","○","○","×","○","○","○","○","○","○","○","○","○","○","○","○","○","○","○","○","×","○","○","○","○","○","○","○","○","○","○","○","○","○","○","○","○","×","○","○","○","○","○","○","○","○","○","○","○","○","○","○","×","○","○","○","○","○","○","○","○","○","○","○","○","○","○","○","○","×","○","○","○","○","○","○","○","○","○","○","○","○","○","○","○","○","○","×","○","○","○","○","○","×","○","○","○","○","○","○","×","○","○","○","○","○","○","○","○","○","○","○","○","○","○","○","○","×","○","○","○","○","○","○","○","○","○","○","○","○","○","○","○","○","○","○","○","○","×","○","○","○","○","○","○","○","○","×","○",null,"A",null,null,null,null,null,"ネットワーク管理情報入力","ネットワーク関連の管理情報(IPアドレス・サブネットマスク等)を設定・表示する",null,null,null,null,"","","","","",null,null,null,null,"Information entry for network management","Shall set or display of management information related to the network (IP address and subnet mask). "]
[55,null,null,"○","○","○","○","○","○","○","○","○","○","○","○","○","○","○","○","○","○","○","○","○","○","○","○","○","○","○","○","○","○","○","○","○","○","○","○","○","○","○","○","○","○","○","○","○","○","○","○","○","○","○","○","○","○","○","○","○","○","○","○","○","○","○","○","○","○","○","○","○","○","○","○","○","○","○","○","○","○","○","○","○","○","○","○","○","○","○","○","○","○","○","○","○","○","○","○","○","","○","","○","","○","","○","","○","","○","","○","","○","","○","","○","","○","","○","","○","","○","","○","","○","","○","","○","○","○","○","○","○","○","○","○","○","○","○","○","○","○","○","○","○","○","○","○","○","○","○","○","○","○","○","○","○","○","○","○","○","○","○","○","○","○","○","○","○","○","○","○","○","○","○","○","○","○","○","○","○","○","○","○","○","○","○","○","○","○","○","○","○","○","○","○","○","○","○","○","○","○","○","○","○","○","○","○","○","○","○","○","○","○","○","○","○","○","○","○","○","○","○","○","○","○","○","○","○","○","○","○","○","○","○","○","○","○","○","○","○","○","○","○","○","○","○","○","○","○","○","○","○","○","○","○","○","○","○","○","○","○","○","○","○","○","○","○","○","○","○","○","○","○","○","○","○","○","○","○","○","○","○","○","○","○","○","○","○","○","○","○","○","○","○","○","○","○","○","×","○","○","○","○","○","○","○","○","○","○","×","○","○","○","○","○","○","○","○","○","○","○","○","○","○","○","○","×","○","○","○","○","○","○","○","○","○","○","○","○","○","○","×","○","○","○","○","○","○","○","○","○","○","○","○","○","×","○","○","○","○","○","○","○","○","○","○","○","○","○","○","○","○","×","○","○","○","○","○","○","○","○","○","○","○","○","○","○","×","○","○","○","○","○","○","○","○","○","○","○","○","○","○","○","○","×","○","○","○","○","○","○","○","○","○","○","○","○","○","○","×","○","○","○","○","○","○","○","○","○","○","○","○","○","○","○","○","×","○","○","○","○","○","○","○","○","○","○","○","○","○","○","○","○","×","○","○","○","○","○","○","○","○","○","○","○","○","○","○","○","○","×","○","○","○","○","○","○","○","○","○","○","○","○","○","○","×","○","○","○","○","○","○","○","○","○","○","○","○","○","○","○","○","×","○","○","○","○","○","○","○","○","○","○","○","○","○","○","○","○","○","×","○","○","○","○","○","×","○","○","○","○","○","○","×","○","○","○","○","○","○","○","○","○","○","○","○","○","○","○","○","×","○","○","○","○","○","○","○","○","○","○","○","○","○","○","○","○","○","○","○","○","×","○","○","○","○","○","○","○","○","×","○",null,"A",null,null,null,null,"3) Real mode TWAINドライバから","スキャンモード入力","PC起動のスキャンのモードを設定・表示する\nPush/Pull いずれのスキャンでも使用できる。",null,null,null,null,"","","","","",null,null,null,"3) From Real mode TWAIN driver","Scan mode entry ","Setting or displaying of scan mode for PC start-up.\nEither of Push or Pull scan can be used. "]
[56,null,null,"○","○","○","○","○","○","○","○","○","○","○","○","○","○","○","○","○","○","○","○","○","○","○","○","○","○","○","○","○","○","○","○","○","○","○","○","○","○","○","○","○","○","○","○","○","○","○","○","○","○","○","○","○","○","○","○","○","○","○","○","○","○","○","○","○","○","○","○","○","○","○","○","○","○","○","○","○","○","○","○","○","○","○","○","○","○","○","○","○","○","○","○","○","○","○","○","○","","○","","○","","○","","○","","○","","○","","○","","○","","○","","○","","○","","○","","○","","○","","○","","○","","○","","○","○","○","○","○","○","○","○","○","○","○","○","○","○","○","○","○","○","○","○","○","○","○","○","○","○","○","○","○","○","○","○","○","○","○","○","○","○","○","○","○","○","○","○","○","○","○","○","○","○","○","○","○","○","○","○","○","○","○","○","○","○","○","○","○","○","○","○","○","○","○","○","○","○","○","○","○","○","○","○","○","○","○","○","○","○","○","○","○","○","○","○","○","○","○","○","○","○","○","○","○","○","○","○","○","○","○","○","○","○","○","○","○","○","○","○","○","○","○","○","○","○","○","○","○","○","○","○","○","○","○","○","○","○","○","○","○","○","○","○","○","○","○","○","○","○","○","○","○","○","○","○","○","○","○","○","○","○","○","○","○","○","○","○","○","○","○","○","○","○","○","○","×","○","○","○","○","○","○","○","○","○","○","×","○","○","○","○","○","○","○","○","○","○","○","○","○","○","○","○","×","○","○","○","○","○","○","○","○","○","○","○","○","○","○","×","○","○","○","○","○","○","○","○","○","○","○","○","○","×","○","○","○","○","○","○","○","○","○","○","○","○","○","○","○","○","×","○","○","○","○","○","○","○","○","○","○","○","○","○","○","×","○","○","○","○","○","○","○","○","○","○","○","○","○","○","○","○","×","○","○","○","○","○","○","○","○","○","○","○","○","○","○","×","○","○","○","○","○","○","○","○","○","○","○","○","○","○","○","○","×","○","○","○","○","○","○","○","○","○","○","○","○","○","○","○","○","×","○","○","○","○","○","○","○","○","○","○","○","○","○","○","○","○","×","○","○","○","○","○","○","○","○","○","○","○","○","○","○","×","○","○","○","○","○","○","○","○","○","○","○","○","○","○","○","○","×","○","○","○","○","○","○","○","○","○","○","○","○","○","○","○","○","○","×","○","○","○","○","○","×","○","○","○","○","○","○","×","○","○","○","○","○","○","○","○","○","○","○","○","○","○","○","○","×","○","○","○","○","○","○","○","○","○","○","○","○","○","○","○","○","○","○","○","○","×","○","○","○","○","○","○","○","○","×","○",null,"A",null,null,null,null,null,"画像プレビュー表示","取り込んだ画像をプレビュー表示する\nPush/Pull いずれのスキャンでも使用できる。",null,null,null,null,"","","","","",null,null,null,null,"Image preview display","Displays preview of scanned image. \nEither of Push or Pull scan can be used. "]
[57,null,null,"○","○","○","○","○","○","○","○","○","○","○","○","○","○","○","○","○","○","○","○","○","○","○","○","○","○","○","○","○","○","○","○","○","○","○","○","○","○","○","○","○","○","○","○","○","○","○","○","○","○","○","○","○","○","○","○","○","○","○","○","○","○","○","○","○","○","○","○","○","○","○","○","○","○","○","○","○","○","○","○","○","○","○","○","○","○","○","○","○","○","○","○","○","○","○","○","○","","○","","○","","○","","○","","○","","○","","○","","○","","○","","○","","○","","○","","○","","○","","○","","○","","○","","○","○","○","○","○","○","○","○","○","○","○","○","○","○","○","○","○","○","○","○","○","○","○","○","○","○","○","○","○","○","○","○","○","○","○","○","○","○","○","○","○","○","○","○","○","○","○","○","○","○","○","○","○","○","○","○","○","○","○","○","○","○","○","○","○","○","○","○","○","○","○","○","○","○","○","○","○","○","○","○","○","○","○","○","○","○","○","○","○","○","○","○","○","○","○","○","○","○","○","○","○","○","○","○","○","○","○","○","○","○","○","○","○","○","○","○","○","○","○","○","○","○","○","○","○","○","○","○","○","○","○","○","○","○","○","○","○","○","○","○","○","○","○","○","○","○","○","○","○","○","○","○","○","○","○","○","○","○","○","○","○","○","○","○","○","○","○","○","○","○","○","○","×","○","○","○","○","○","○","○","○","○","○","×","○","○","○","○","○","○","○","○","○","○","○","○","○","○","○","○","×","○","○","○","○","○","○","○","○","○","○","○","○","○","○","×","○","○","○","○","○","○","○","○","○","○","○","○","○","×","○","○","○","○","○","○","○","○","○","○","○","○","○","○","○","○","×","○","○","○","○","○","○","○","○","○","○","○","○","○","○","×","○","○","○","○","○","○","○","○","○","○","○","○","○","○","○","○","×","○","○","○","○","○","○","○","○","○","○","○","○","○","○","×","○","○","○","○","○","○","○","○","○","○","○","○","○","○","○","○","×","○","○","○","○","○","○","○","○","○","○","○","○","○","○","○","○","×","○","○","○","○","○","○","○","○","○","○","○","○","○","○","○","○","×","○","○","○","○","○","○","○","○","○","○","○","○","○","○","×","○","○","○","○","○","○","○","○","○","○","○","○","○","○","○","○","×","○","○","○","○","○","○","○","○","○","○","○","○","○","○","○","○","○","×","○","○","○","○","○","×","○","○","○","○","○","○","×","○","○","○","○","○","○","○","○","○","○","○","○","○","○","○","○","×","○","○","○","○","○","○","○","○","○","○","○","○","○","○","○","○","○","○","○","○","×","○","○","○","○","○","○","○","○","×","○",null,"A",null,null,null,null,null,"スキャン開始・破棄","Pull TWAINの場合、PC起動のスキャンの開始・破棄を行う",null,null,null,null,"","","","","",null,null,null,null,"Scan start-up / deletion ","For Pull TWAIN, starting or deletion for PC start-up scan . ",null,null,null,null,null,null,null,null,null,null,null,null,null,null,null,null,null,null,null,null,null,null,null,null,null,null,null,null,null,null,null,null,null,null,null,null,null,null,null,null,null,null,null,null,null,null,2,"READ 15-2","Pattern-15",{"$f":"\"ユースケース\"&TEXT(YL76,\"0\")&\"&シーケンス\"&TEXT(YM76,\"0\")&\"&制御パターン\"&TEXT(YN76,\"0\")","v":"ユースケース2&シーケンスREAD 15-2&制御パターンPattern-15"},"ユースケース2&シーケンスREAD 15-2&制御パターンPattern-15"]
[58,null,null,"○","○","○","○","○","○","○","○","○","○","○","○","○","○","○","○","○","○","○","○","○","○","○","○","○","○","○","○","○","○","○","○","○","○","○","○","○","○","○","○","○","○","○","○","○","○","○","○","○","○","○","○","○","○","○","○","○","○","○","○","○","○","○","○","○","○","○","○","○","○","○","○","○","○","○","○","○","○","○","○","○","○","○","○","○","○","○","○","○","○","○","○","○","○","○","○","○","","○","","○","","○","","○","","○","","○","","○","","○","","○","","○","","○","","○","","○","","○","","○","","○","","○","","○","○","○","○","○","○","○","○","○","○","○","○","○","○","○","○","○","○","○","○","○","○","○","○","○","○","○","○","○","○","○","○","○","○","○","○","○","○","○","○","○","○","○","○","○","○","○","○","○","○","○","○","○","○","○","○","○","○","○","○","○","○","○","○","○","○","○","○","○","○","○","○","○","○","○","○","○","○","○","○","○","○","○","○","○","○","○","○","○","○","○","○","○","○","○","○","○","○","○","○","○","○","○","○","○","○","○","○","○","○","○","○","○","○","○","○","○","○","○","○","○","○","○","○","○","○","○","○","○","○","○","○","○","○","○","○","○","○","○","○","○","○","○","○","○","○","○","○","○","○","○","○","○","○","○","○","○","○","○","○","○","○","○","○","○","○","○","○","○","○","○","○","×","○","○","○","○","○","○","○","○","○","○","×","○","○","○","○","○","○","○","○","○","○","○","○","○","○","○","○","×","○","○","○","○","○","○","○","○","○","○","○","○","○","○","×","○","○","○","○","○","○","○","○","○","○","○","○","○","×","○","○","○","○","○","○","○","○","○","○","○","○","○","○","○","○","×","○","○","○","○","○","○","○","○","○","○","○","○","○","○","×","○","○","○","○","○","○","○","○","○","○","○","○","○","○","○","○","×","○","○","○","○","○","○","○","○","○","○","○","○","○","○","×","○","○","○","○","○","○","○","○","○","○","○","○","○","○","○","○","×","○","○","○","○","○","○","○","○","○","○","○","○","○","○","○","○","×","○","○","○","○","○","○","○","○","○","○","○","○","○","○","○","○","×","○","○","○","○","○","○","○","○","○","○","○","○","○","○","×","○","○","○","○","○","○","○","○","○","○","○","○","○","○","○","○","×","○","○","○","○","○","○","○","○","○","○","○","○","○","○","○","○","○","×","○","○","○","○","○","×","○","○","○","○","○","○","×","○","○","○","○","○","○","○","○","○","○","○","○","○","○","○","○","×","○","○","○","○","○","○","○","○","○","○","○","○","○","○","○","○","○","○","○","○","×","○","○","○","○","○","○","○","○","×","○",null,"A",null,null,null,null,null,null,"Push TWAINの場合、パネルからスキャンの開始･削除を行う。PC側からはパネルロック･削除を行う\n",null,null,null,null,"","","","","",null,null,null,null,null,"For Push TWAIN, starting or deletion of scan for PC start-up. \nPanel lock or deletion is performed on PC. \n",null,null,null,null,null,null,null,null,null,null,null,null,null,null,null,null,null,null,null,null,null,null,null,null,null,null,null,null,null,null,null,null,null,null,null,null,null,null,null,null,null,null,null,null,null,null,2,"READ 15-2","Pattern-15",{"$f":"\"ユースケース\"&TEXT(YL77,\"0\")&\"&シーケンス\"&TEXT(YM77,\"0\")&\"&制御パターン\"&TEXT(YN77,\"0\")","v":"ユースケース2&シーケンスREAD 15-2&制御パターンPattern-15"},"ユースケース2&シーケンスREAD 15-2&制御パターンPattern-15"]
[59,null,null,"○","○","○","○","○","○","○","○","○","○","○","○","○","○","○","○","○","○","○","○","○","○","○","○","○","○","○","○","○","○","○","○","○","○","○","○","○","○","○","○","○","○","○","○","○","○","○","○","○","○","○","○","○","○","○","○","○","○","○","○","○","○","○","○","○","○","○","○","○","○","○","○","○","○","○","○","○","○","○","○","○","○","○","○","○","○","○","○","○","○","○","○","○","○","○","○","○","","○","","○","","○","","○","","○","","○","","○","","○","","○","","○","","○","","○","","○","","○","","○","","○","","○","","○","○","○","○","○","○","○","○","○","○","○","○","○","○","○","○","○","○","○","○","○","○","○","○","○","○","○","○","○","○","○","○","○","○","○","○","○","○","○","○","○","○","○","○","○","○","○","○","○","○","○","○","○","○","○","○","○","○","○","○","○","○","○","○","○","○","○","○","○","○","○","○","○","○","○","○","○","○","○","○","○","○","○","○","○","○","○","○","○","○","○","○","○","○","○","○","○","○","○","○","○","○","○","○","○","○","○","○","○","○","○","○","○","○","○","○","○","○","○","○","○","○","○","○","○","○","○","○","○","○","○","○","○","○","○","○","○","○","○","○","○","○","○","○","○","○","○","○","○","○","○","○","○","○","○","○","○","○","○","○","○","○","○","○","○","○","○","○","○","○","○","○","×","○","○","○","○","○","○","○","○","○","○","×","○","○","○","○","○","○","○","○","○","○","○","○","○","○","○","○","×","○","○","○","○","○","○","○","○","○","○","○","○","○","○","×","○","○","○","○","○","○","○","○","○","○","○","○","○","×","○","○","○","○","○","○","○","○","○","○","○","○","○","○","○","○","×","○","○","○","○","○","○","○","○","○","○","○","○","○","○","×","○","○","○","○","○","○","○","○","○","○","○","○","○","○","○","○","×","○","○","○","○","○","○","○","○","○","○","○","○","○","○","×","○","○","○","○","○","○","○","○","○","○","○","○","○","○","○","○","×","○","○","○","○","○","○","○","○","○","○","○","○","○","○","○","○","×","○","○","○","○","○","○","○","○","○","○","○","○","○","○","○","○","×","○","○","○","○","○","○","○","○","○","○","○","○","○","○","×","○","○","○","○","○","○","○","○","○","○","○","○","○","○","○","○","×","○","○","○","○","○","○","○","○","○","○","○","○","○","○","○","○","○","×","○","○","○","○","○","×","○","○","○","○","○","○","×","○","○","○","○","○","○","○","○","○","○","○","○","○","○","○","○","×","○","○","○","○","○","○","○","○","○","○","○","○","○","○","○","○","○","○","○","○","×","○","○","○","○","○","○","○","○","×","○",null,"A",null,null,null,null,null,"トリミング","プレビュー表示内で領域を指定し、本スキャンを行う。\n指定できる領域は1つの領域のみとする。\nただし、スキャン画像の受け渡しは通常のScanと同じとする。領域の分離はTwainドライバで行う。\nPush/Pull いずれのスキャンでも使用できる。",null,null,null,null,"","","","","",null,null,null,null,"Trimming ","Performed scanning with scan range defined on the preview display.  Defined range shall be one.  For a reception or transmission of scanned image shall be a normal scan. \nSeparation of scan range shall be performed by the Twain driver. "]
[60,null,null,"○","○","○","○","○","○","○","○","○","○","○","○","○","○","○","○","○","○","○","○","○","○","○","○","○","○","○","○","○","○","○","○","○","○","○","○","○","○","○","○","○","○","○","○","○","○","○","○","○","○","○","○","○","○","○","○","○","○","○","○","○","○","○","○","○","○","○","○","○","○","○","○","○","○","○","○","○","○","○","○","○","○","○","○","○","○","○","○","○","○","○","○","○","○","○","○","○","","○","","○","","○","","○","","○","","○","","○","","○","","○","","○","","○","","○","","○","","○","","○","","○","","○","","○","○","○","○","○","○","○","○","○","○","○","○","○","○","○","○","○","○","○","○","○","○","○","○","○","○","○","○","○","○","○","○","○","○","○","○","○","○","○","○","×","×","○","○","○","○","○","○","○","○","○","○","○","○","○","○","○","○","○","○","○","○","○","○","○","○","○","○","○","○","○","○","○","○","○","○","○","○","○","○","○","○","○","○","○","○","○","○","○","○","○","○","○","○","○","○","○","○","○","○","○","○","○","○","○","○","○","○","○","○","○","○","○","○","○","○","○","○","○","○","○","○","○","○","○","○","○","○","○","○","○","○","○","○","○","○","○","○","○","○","○","○","○","○","○","○","○","○","○","○","○","○","○","○","○","○","○","○","○","○","○","○","○","○","○","○","○","○","○","○","○","○","×","○","○","○","○","○","○","○","○","○","○","×","○","○","○","○","○","○","○","○","○","○","○","○","○","○","○","○","×","○","○","○","○","○","○","○","○","○","○","○","○","○","○","×","○","○","○","○","○","○","○","○","○","○","○","○","○","×","○","○","○","○","○","○","○","○","○","○","○","○","○","○","○","○","×","○","○","○","○","○","○","○","○","○","○","○","○","○","○","×","○","○","○","○","○","○","○","○","○","○","○","○","○","○","○","○","×","○","○","○","○","○","○","○","○","○","○","○","○","○","○","×","○","○","○","○","○","○","○","○","○","○","○","○","○","○","○","○","×","○","○","○","○","○","○","○","○","○","○","○","○","○","○","○","○","×","○","○","○","○","○","○","○","○","○","○","○","○","○","○","○","○","×","○","○","○","○","○","○","○","○","○","○","○","○","○","○","×","○","○","○","○","○","○","○","○","○","○","○","○","○","○","○","○","×","○","○","○","○","○","○","○","○","○","○","○","○","○","○","○","○","○","×","○","○","○","○","○","×","○","○","○","○","○","○","×","○","○","○","○","○","○","○","○","○","○","○","○","○","○","○","○","×","○","○","○","○","○","○","○","○","○","○","○","○","○","○","○","○","○","○","○","○","×","○","○","○","○","○","○","○","○","×","○",null,"A","S",null,null,null,"4) HDD TWAINドライバから","ボックスの選択","ｽｷｬﾝした画像ﾃﾞｰﾀが保存されているBoxのﾘｽﾄを表示する","(*5)",null,null,null,{"$f":"IF(WF79=\"\",\"\",DEC2BIN(WF79,4))","v":""},{"$f":"IF($WG79=\"\",\"\",VALUE(MID($WG79,1,1)))","v":""},{"$f":"IF($WG79=\"\",\"\",VALUE(MID($WG79,2,1)))","v":""},{"$f":"IF($WG79=\"\",\"\",VALUE(MID($WG79,3,1)))","v":""},{"$f":"IF($WG79=\"\",\"\",VALUE(MID($WG79,4,1)))","v":""},null,null,null,"4) From HDD TWAIN driver","Selection of Box","Scanned image data shall display a Box list in which such image data is stored. ",null,null,null,null,null,null,null,null,null,null,null,null,null,null,null,null,null,null,null,null,null,null,null,null,null,null,null,null,null,null,null,null,null,null,null,null,"○"]
[61,null,null,"○","○","○","○","○","○","○","○","○","○","○","○","○","○","○","○","○","○","○","○","○","○","○","○","○","○","○","○","○","○","○","○","○","○","○","○","○","○","○","○","○","○","○","○","○","○","○","○","○","○","○","○","○","○","○","○","○","○","○","○","○","○","○","○","○","○","○","○","○","○","○","○","○","○","○","○","○","○","○","○","○","○","○","○","○","○","○","○","○","○","○","○","○","○","○","○","○","","○","","○","","○","","○","","○","","○","","○","","○","","○","","○","","○","","○","","○","","○","","○","","○","","○","","○","○","○","○","○","○","○","○","○","○","○","○","○","○","○","○","○","○","○","○","○","○","○","○","○","○","○","○","○","○","○","○","○","○","○","○","○","○","○","○","×","×","○","○","○","○","○","○","○","○","○","○","○","○","○","○","○","○","○","○","○","○","○","○","○","○","○","○","○","○","○","○","○","○","○","○","○","○","○","○","○","○","○","○","○","○","○","○","○","○","○","○","○","○","○","○","○","○","○","○","○","○","○","○","○","○","○","○","○","○","○","○","○","○","○","○","○","○","○","○","○","○","○","○","○","○","○","○","○","○","○","○","○","○","○","○","○","○","○","○","○","○","○","○","○","○","○","○","○","○","○","○","○","○","○","○","○","○","○","○","○","○","○","○","○","○","○","○","○","○","○","○","×","○","○","○","○","○","○","○","○","○","○","×","○","○","○","○","○","○","○","○","○","○","○","○","○","○","○","○","×","○","○","○","○","○","○","○","○","○","○","○","○","○","○","×","○","○","○","○","○","○","○","○","○","○","○","○","○","×","○","○","○","○","○","○","○","○","○","○","○","○","○","○","○","○","×","○","○","○","○","○","○","○","○","○","○","○","○","○","○","×","○","○","○","○","○","○","○","○","○","○","○","○","○","○","○","○","×","○","○","○","○","○","○","○","○","○","○","○","○","○","○","×","○","○","○","○","○","○","○","○","○","○","○","○","○","○","○","○","×","○","○","○","○","○","○","○","○","○","○","○","○","○","○","○","○","×","○","○","○","○","○","○","○","○","○","○","○","○","○","○","○","○","×","○","○","○","○","○","○","○","○","○","○","○","○","○","○","×","○","○","○","○","○","○","○","○","○","○","○","○","○","○","○","○","×","○","○","○","○","○","○","○","○","○","○","○","○","○","○","○","○","○","×","○","○","○","○","○","×","○","○","○","○","○","○","×","○","○","○","○","○","○","○","○","○","○","○","○","○","○","○","○","×","○","○","○","○","○","○","○","○","○","○","○","○","○","○","○","○","○","○","○","○","×","○","○","○","○","○","○","○","○","×","○",null,"A","S",null,null,null,null,"ﾌｧｲﾙﾘｽﾄの表示","Boxが選択されると選択されたBoxに保存されている画像ﾃﾞｰﾀ　のﾘｽﾄを表示する","(*5)",null,null,null,"","","","","",null,null,null,null,"Displaying a file list","Selects a Box shall display the stored image information list stored in the Box.  ",null,null,null,null,null,null,null,null,null,null,null,null,null,null,null,null,null,null,null,null,null,null,null,null,null,null,null,null,null,null,null,null,null,null,null,null,"○"]
[62,null,null,"○","○","○","○","○","○","○","○","○","○","○","○","○","○","○","○","○","○","○","○","○","○","○","○","○","○","○","○","○","○","○","○","○","○","○","○","○","○","○","○","○","○","○","○","○","○","○","○","○","○","○","○","○","○","○","○","○","○","○","○","○","○","○","○","○","○","○","○","○","○","○","○","○","○","○","○","○","○","○","○","○","○","○","○","○","○","○","○","○","○","○","○","○","○","○","○","○","","○","","○","","○","","○","","○","","○","","○","","○","","○","","○","","○","","○","","○","","○","","○","","○","","○","","○","○","○","○","○","○","○","○","○","○","○","○","○","○","○","○","○","○","○","○","○","○","○","○","○","○","○","○","○","○","○","○","○","○","○","○","○","○","○","○","×","×","○","○","○","○","○","○","○","○","○","○","○","○","○","○","○","○","○","○","○","○","○","○","○","○","○","○","○","○","○","○","○","○","○","○","○","○","○","○","○","○","○","○","○","○","○","○","○","○","○","○","○","○","○","○","○","○","○","○","○","○","○","○","○","○","○","○","○","○","○","○","○","○","○","○","○","○","○","○","○","○","○","○","○","○","○","○","○","○","○","○","○","○","○","○","○","○","○","○","○","○","○","○","○","○","○","○","○","○","○","○","○","○","○","○","○","○","○","○","○","○","○","○","○","○","○","○","○","○","○","○","×","○","○","○","○","○","○","○","○","○","○","×","○","○","○","○","○","○","○","○","○","○","○","○","○","○","○","○","×","○","○","○","○","○","○","○","○","○","○","○","○","○","○","×","○","○","○","○","○","○","○","○","○","○","○","○","○","×","○","○","○","○","○","○","○","○","○","○","○","○","○","○","○","○","×","○","○","○","○","○","○","○","○","○","○","○","○","○","○","×","○","○","○","○","○","○","○","○","○","○","○","○","○","○","○","○","×","○","○","○","○","○","○","○","○","○","○","○","○","○","○","×","○","○","○","○","○","○","○","○","○","○","○","○","○","○","○","○","×","○","○","○","○","○","○","○","○","○","○","○","○","○","○","○","○","×","○","○","○","○","○","○","○","○","○","○","○","○","○","○","○","○","×","○","○","○","○","○","○","○","○","○","○","○","○","○","○","×","○","○","○","○","○","○","○","○","○","○","○","○","○","○","○","○","×","○","○","○","○","○","○","○","○","○","○","○","○","○","○","○","○","○","×","○","○","○","○","○","×","○","○","○","○","○","○","×","○","○","○","○","○","○","○","○","○","○","○","○","○","○","○","○","×","○","○","○","○","○","○","○","○","○","○","○","○","○","○","○","○","○","○","○","○","×","○","○","○","○","○","○","○","○","×","○",null,"A","S",null,null,null,null,"サムネイルの表示","Boxが選択されている場合に、Boxに保存されている画像ﾃﾞｰﾀのｻﾑﾈｲﾙを表示する。","(*5)",null,null,null,"","","","","",null,null,null,null,"Thumbnail-size image data display","While a Box is selected, a thumbnail-size image data stored in a box is displayed.  \n",null,null,null,null,null,null,null,null,null,null,null,null,null,null,null,null,null,null,null,null,null,null,null,null,null,null,null,null,null,null,null,null,null,null,null,null,"○"]
[63,null,null,"○","○","○","○","○","○","○","○","○","○","○","○","○","○","○","○","○","○","○","○","○","○","○","○","○","○","○","○","○","○","○","○","○","○","○","○","○","○","○","○","○","○","○","○","○","○","○","○","○","○","○","○","○","○","○","○","○","○","○","○","○","○","○","○","○","○","○","○","○","○","○","○","○","○","○","○","○","○","○","○","○","○","○","○","○","○","○","○","○","○","○","○","○","○","○","○","○","","○","","○","","○","","○","","○","","○","","○","","○","","○","","○","","○","","○","","○","","○","","○","","○","","○","","○","○","○","○","○","○","○","○","○","○","○","○","○","○","○","○","○","○","○","○","○","○","○","○","○","○","○","○","○","○","○","○","○","○","○","○","○","○","○","○","×","×","○","○","○","○","○","○","○","○","○","○","○","○","○","○","○","○","○","○","○","○","○","○","○","○","○","○","○","○","○","○","○","○","○","○","○","○","○","○","○","○","○","○","○","○","○","○","○","○","○","○","○","○","○","○","○","○","○","○","○","○","○","○","○","○","○","○","○","○","○","○","○","○","○","○","○","○","○","○","○","○","○","○","○","○","○","○","○","○","○","○","○","○","○","○","○","○","○","○","○","○","○","○","○","○","○","○","○","○","○","○","○","○","○","○","○","○","○","○","○","○","○","○","○","○","○","○","○","○","○","○","×","○","○","○","○","○","○","○","○","○","○","×","○","○","○","○","○","○","○","○","○","○","○","○","○","○","○","○","×","○","○","○","○","○","○","○","○","○","○","○","○","○","○","×","○","○","○","○","○","○","○","○","○","○","○","○","○","×","○","○","○","○","○","○","○","○","○","○","○","○","○","○","○","○","×","○","○","○","○","○","○","○","○","○","○","○","○","○","○","×","○","○","○","○","○","○","○","○","○","○","○","○","○","○","○","○","×","○","○","○","○","○","○","○","○","○","○","○","○","○","○","×","○","○","○","○","○","○","○","○","○","○","○","○","○","○","○","○","×","○","○","○","○","○","○","○","○","○","○","○","○","○","○","○","○","×","○","○","○","○","○","○","○","○","○","○","○","○","○","○","○","○","×","○","○","○","○","○","○","○","○","○","○","○","○","○","○","×","○","○","○","○","○","○","○","○","○","○","○","○","○","○","○","○","×","○","○","○","○","○","○","○","○","○","○","○","○","○","○","○","○","○","×","○","○","○","○","○","×","○","○","○","○","○","○","×","○","○","○","○","○","○","○","○","○","○","○","○","○","○","○","○","×","○","○","○","○","○","○","○","○","○","○","○","○","○","○","○","○","○","○","○","○","×","○","○","○","○","○","○","○","○","×","○",null,"A","S",null,null,null,null,"読み込み･破棄･削除","PC起動のBoxに保存されている画像の読込み、破棄(Cancel)･削除を行う。","(*5)",null,null,null,"","","","","",null,null,null,null,"Scanning/ deletion / cancel","Performed scanning, cancel or deletion stored in a Box for PC start-up. \n",null,null,null,null,null,null,null,null,null,null,null,null,null,null,null,null,null,null,null,null,null,null,null,null,null,null,null,null,null,null,null,null,null,null,null,null,"○"]
["63-2",null,null,"○","○","○","○","○","○","○","○","○","○","○","○","○","○","○","○","○","○","○","○","○","○","○","○","○","○","○","○","○","○","○","○","○","○","○","○","○","○","○","○","○","○","○","○","○","○","○","○","○","○","○","○","○","○","○","○","○","○","○","○","○","○","○","○","○","○","○","○","○","○","○","○","○","○","○","○","○","○","○","○","○","○","○","○","○","○","○","○","○","○","○","○","○","○","○","○","○","","○","","○","","○","","○","","○","","○","","○","","○","","○","","○","","○","","○","","○","","○","","○","","○","","○","","○","○","○","○","○","○","○","○","○","○","○","○","○","○","○","○","○","○","○","○","○","○","○","○","○","○","○","○","○","○","○","○","○","○","○","○","○","○","○","○","○","○","○","○","○","○","○","○","○","○","○","○","○","○","○","○","○","○","○","○","○","○","○","○","○","○","○","○","○","○","○","○","○","○","○","○","○","○","○","○","○","○","○","○","○","○","○","○","○","○","○","○","○","○","○","○","○","○","○","○","○","○","○","○","○","○","○","○","○","○","○","○","○","○","○","○","○","○","○","○","○","○","○","○","○","○","○","○","○","○","○","○","○","○","○","○","○","○","○","○","○","○","○","○","○","○","○","○","○","○","○","○","○","○","○","○","○","○","○","○","○","○","○","○","○","○","○","○","○","○","○","○","×","○","○","○","○","○","○","○","○","○","○","×","○","○","○","○","○","○","○","○","○","○","○","○","○","○","○","○","×","○","○","○","○","○","○","○","○","○","○","○","○","○","○","×","○","○","○","○","○","○","○","○","○","○","○","○","○","×","○","○","○","○","○","○","○","○","○","○","○","○","○","○","○","○","×","○","○","○","○","○","○","○","○","○","○","○","○","○","○","×","○","○","○","○","○","○","○","○","○","○","○","○","○","○","○","○","×","○","○","○","○","○","○","○","○","○","○","○","○","○","○","×","○","○","○","○","○","○","○","○","○","○","○","○","○","○","○","○","×","○","○","○","○","○","○","○","○","○","○","○","○","○","○","○","○","×","○","○","○","○","○","○","○","○","○","○","○","○","○","○","○","○","×","○","○","○","○","○","○","○","○","○","○","○","○","○","○","×","○","○","○","○","○","○","○","○","○","○","○","○","○","○","○","○","×","○","○","○","○","○","○","○","○","○","○","○","○","○","○","○","○","○","×","○","○","○","○","○","×","○","○","○","○","○","○","×","○","○","○","○","○","○","○","○","○","○","○","○","○","○","○","○","×","○","○","○","○","○","○","○","○","○","○","○","○","○","○","○","○","○","○","○","○","×","○","○","○","○","○","○","○","○","×","○",null,"A",null,null,null,null,"5) WSDスキャンから","スキャンモード入力","PC起動のスキャンのモードを設定・表示する\nPush/Pull いずれのスキャンでも使用できる。\n(スキャンプロファイルにて設定)",null,null,null,1,"0001",0,0,0,1,null,null,null,null,"Scan mode entry "]
["63-3",null,null,"○","○","○","○","○","○","○","○","○","○","○","○","○","○","○","○","○","○","○","○","○","○","○","○","○","○","○","○","○","○","○","○","○","○","○","○","○","○","○","○","○","○","○","○","○","○","○","○","○","○","○","○","○","○","○","○","○","○","○","○","○","○","○","○","○","○","○","○","○","○","○","○","○","○","○","○","○","○","○","○","○","○","○","○","○","○","○","○","○","○","○","○","○","○","○","○","○","","○","","○","","○","","○","","○","","○","","○","","○","","○","","○","","○","","○","","○","","○","","○","","○","","○","","○","○","○","○","○","○","○","○","○","○","○","○","○","○","○","○","○","○","○","○","○","○","○","○","○","○","○","○","○","○","○","○","○","○","○","○","○","○","○","○","○","○","○","○","○","○","○","○","○","○","○","○","○","○","○","○","○","○","○","○","○","○","○","○","○","○","○","○","○","○","○","○","○","○","○","○","○","○","○","○","○","○","○","○","○","○","○","○","○","○","○","○","○","○","○","○","○","○","○","○","○","○","○","○","○","○","○","○","○","○","○","○","○","○","○","○","○","○","○","○","○","○","○","○","○","○","○","○","○","○","○","○","○","○","○","○","○","○","○","○","○","○","○","○","○","○","○","○","○","○","○","○","○","○","○","○","○","○","○","○","○","○","○","○","○","○","○","○","○","○","○","○","×","○","○","○","○","○","○","○","○","○","○","×","○","○","○","○","○","○","○","○","○","○","○","○","○","○","○","○","×","○","○","○","○","○","○","○","○","○","○","○","○","○","○","×","○","○","○","○","○","○","○","○","○","○","○","○","○","×","○","○","○","○","○","○","○","○","○","○","○","○","○","○","○","○","×","○","○","○","○","○","○","○","○","○","○","○","○","○","○","×","○","○","○","○","○","○","○","○","○","○","○","○","○","○","○","○","×","○","○","○","○","○","○","○","○","○","○","○","○","○","○","×","○","○","○","○","○","○","○","○","○","○","○","○","○","○","○","○","×","○","○","○","○","○","○","○","○","○","○","○","○","○","○","○","○","×","○","○","○","○","○","○","○","○","○","○","○","○","○","○","○","○","×","○","○","○","○","○","○","○","○","○","○","○","○","○","○","×","○","○","○","○","○","○","○","○","○","○","○","○","○","○","○","○","×","○","○","○","○","○","○","○","○","○","○","○","○","○","○","○","○","○","×","○","○","○","○","○","×","○","○","○","○","○","○","×","○","○","○","○","○","○","○","○","○","○","○","○","○","○","○","○","×","○","○","○","○","○","○","○","○","○","○","○","○","○","○","○","○","○","○","○","○","×","○","○","○","○","○","○","○","○","×","○",null,"A",null,null,null,null,null,"画像プレビュー表示","取り込んだ画像をプレビュー表示する\nPush/Pull いずれのスキャンでも使用できる。\n(スキャンプロファイルにて設定)",null,null,null,1,"0001",0,0,0,1,null,null,null,null,"Image preview display"]
["63-4",null,null,"○","○","○","○","○","○","○","○","○","○","○","○","○","○","○","○","○","○","○","○","○","○","○","○","○","○","○","○","○","○","○","○","○","○","○","○","○","○","○","○","○","○","○","○","○","○","○","○","○","○","○","○","○","○","○","○","○","○","○","○","○","○","○","○","○","○","○","○","○","○","○","○","○","○","○","○","○","○","○","○","○","○","○","○","○","○","○","○","○","○","○","○","○","○","○","○","○","","○","","○","","○","","○","","○","","○","","○","","○","","○","","○","","○","","○","","○","","○","","○","","○","","○","","○","○","○","○","○","○","○","○","○","○","○","○","○","○","○","○","○","○","○","○","○","○","○","○","○","○","○","○","○","○","○","○","○","○","○","○","○","○","○","○","○","○","○","○","○","○","○","○","○","○","○","○","○","○","○","○","○","○","○","○","○","○","○","○","○","○","○","○","○","○","○","○","○","○","○","○","○","○","○","○","○","○","○","○","○","○","○","○","○","○","○","○","○","○","○","○","○","○","○","○","○","○","○","○","○","○","○","○","○","○","○","○","○","○","○","○","○","○","○","○","○","○","○","○","○","○","○","○","○","○","○","○","○","○","○","○","○","○","○","○","○","○","○","○","○","○","○","○","○","○","○","○","○","○","○","○","○","○","○","○","○","○","○","○","○","○","○","○","○","○","○","○","×","○","○","○","○","○","○","○","○","○","○","×","○","○","○","○","○","○","○","○","○","○","○","○","○","○","○","○","×","○","○","○","○","○","○","○","○","○","○","○","○","○","○","×","○","○","○","○","○","○","○","○","○","○","○","○","○","×","○","○","○","○","○","○","○","○","○","○","○","○","○","○","○","○","×","○","○","○","○","○","○","○","○","○","○","○","○","○","○","×","○","○","○","○","○","○","○","○","○","○","○","○","○","○","○","○","×","○","○","○","○","○","○","○","○","○","○","○","○","○","○","×","○","○","○","○","○","○","○","○","○","○","○","○","○","○","○","○","×","○","○","○","○","○","○","○","○","○","○","○","○","○","○","○","○","×","○","○","○","○","○","○","○","○","○","○","○","○","○","○","○","○","×","○","○","○","○","○","○","○","○","○","○","○","○","○","○","×","○","○","○","○","○","○","○","○","○","○","○","○","○","○","○","○","×","○","○","○","○","○","○","○","○","○","○","○","○","○","○","○","○","○","×","○","○","○","○","○","×","○","○","○","○","○","○","×","○","○","○","○","○","○","○","○","○","○","○","○","○","○","○","○","×","○","○","○","○","○","○","○","○","○","○","○","○","○","○","○","○","○","○","○","○","×","○","○","○","○","○","○","○","○","×","○",null,"A",null,null,null,null,null,"スキャン開始・破棄","Pull スキャンの場合、PC起動のスキャンの開始・破棄を行う",null,null,null,1,"0001",0,0,0,1,null,null,null,null,"Scan start-up / deletion "]
["63-5",null,null,"○","○","○","○","○","○","○","○","○","○","○","○","○","○","○","○","○","○","○","○","○","○","○","○","○","○","○","○","○","○","○","○","○","○","○","○","○","○","○","○","○","○","○","○","○","○","○","○","○","○","○","○","○","○","○","○","○","○","○","○","○","○","○","○","○","○","○","○","○","○","○","○","○","○","○","○","○","○","○","○","○","○","○","○","○","○","○","○","○","○","○","○","○","○","○","○","○","","○","","○","","○","","○","","○","","○","","○","","○","","○","","○","","○","","○","","○","","○","","○","","○","","○","","○","○","○","○","○","○","○","○","○","○","○","○","○","○","○","○","○","○","○","○","○","○","○","○","○","○","○","○","○","○","○","○","○","○","○","○","○","○","○","○","○","○","○","○","○","○","○","○","○","○","○","○","○","○","○","○","○","○","○","○","○","○","○","○","○","○","○","○","○","○","○","○","○","○","○","○","○","○","○","○","○","○","○","○","○","○","○","○","○","○","○","○","○","○","○","○","○","○","○","○","○","○","○","○","○","○","○","○","○","○","○","○","○","○","○","○","○","○","○","○","○","○","○","○","○","○","○","○","○","○","○","○","○","○","○","○","○","○","○","○","○","○","○","○","○","○","○","○","○","○","○","○","○","○","○","○","○","○","○","○","○","○","○","○","○","○","○","○","○","○","○","○","×","○","○","○","○","○","○","○","○","○","○","×","○","○","○","○","○","○","○","○","○","○","○","○","○","○","○","○","×","○","○","○","○","○","○","○","○","○","○","○","○","○","○","×","○","○","○","○","○","○","○","○","○","○","○","○","○","×","○","○","○","○","○","○","○","○","○","○","○","○","○","○","○","○","×","○","○","○","○","○","○","○","○","○","○","○","○","○","○","×","○","○","○","○","○","○","○","○","○","○","○","○","○","○","○","○","×","○","○","○","○","○","○","○","○","○","○","○","○","○","○","×","○","○","○","○","○","○","○","○","○","○","○","○","○","○","○","○","×","○","○","○","○","○","○","○","○","○","○","○","○","○","○","○","○","×","○","○","○","○","○","○","○","○","○","○","○","○","○","○","○","○","×","○","○","○","○","○","○","○","○","○","○","○","○","○","○","×","○","○","○","○","○","○","○","○","○","○","○","○","○","○","○","○","×","○","○","○","○","○","○","○","○","○","○","○","○","○","○","○","○","○","×","○","○","○","○","○","×","○","○","○","○","○","○","×","○","○","○","○","○","○","○","○","○","○","○","○","○","○","○","○","×","○","○","○","○","○","○","○","○","○","○","○","○","○","○","○","○","○","○","○","○","×","○","○","○","○","○","○","○","○","×","○",null,"A",null,null,null,null,null,null,"Push スキャンの場合、パネルからスキャンの開始･削除を行う。PC側からはパネルロック･削除を行う\n",null,null,null,1,"0001",0,0,0,1]
["63-6",null,null,"○","○","○","○","○","○","○","○","○","○","○","○","○","○","○","○","○","○","○","○","○","○","○","○","○","○","○","○","○","○","○","○","○","○","○","○","○","○","○","○","○","○","○","○","○","○","○","○","○","○","○","○","○","○","○","○","○","○","○","○","○","○","○","○","○","○","○","○","○","○","○","○","○","○","○","○","○","○","○","○","○","○","○","○","○","○","○","○","○","○","○","○","○","○","○","○","○","","○","","○","","○","","○","","○","","○","","○","","○","","○","","○","","○","","○","","○","","○","","○","","○","","○","","○","○","○","○","○","○","○","○","○","○","○","○","○","○","○","○","○","○","○","○","○","○","○","○","○","○","○","○","○","○","○","○","○","○","○","○","○","○","○","○","○","○","○","○","○","○","○","○","○","○","○","○","○","○","○","○","○","○","○","○","○","○","○","○","○","○","○","○","○","○","○","○","○","○","○","○","○","○","○","○","○","○","○","○","○","○","○","○","○","○","○","○","○","○","○","○","○","○","○","○","○","○","○","○","○","○","○","○","○","○","○","○","○","○","○","○","○","○","○","○","○","○","○","○","○","○","○","○","○","○","○","○","○","○","○","○","○","○","○","○","○","○","○","○","○","○","○","○","○","○","○","○","○","○","○","○","○","○","○","○","○","○","○","○","○","○","○","○","○","○","○","○","×","○","○","○","○","○","○","○","○","○","○","×","○","○","○","○","○","○","○","○","○","○","○","○","○","○","○","○","×","○","○","○","○","○","○","○","○","○","○","○","○","○","○","×","○","○","○","○","○","○","○","○","○","○","○","○","○","×","○","○","○","○","○","○","○","○","○","○","○","○","○","○","○","○","×","○","○","○","○","○","○","○","○","○","○","○","○","○","○","×","○","○","○","○","○","○","○","○","○","○","○","○","○","○","○","○","×","○","○","○","○","○","○","○","○","○","○","○","○","○","○","×","○","○","○","○","○","○","○","○","○","○","○","○","○","○","○","○","×","○","○","○","○","○","○","○","○","○","○","○","○","○","○","○","○","×","○","○","○","○","○","○","○","○","○","○","○","○","○","○","○","○","×","○","○","○","○","○","○","○","○","○","○","○","○","○","○","×","○","○","○","○","○","○","○","○","○","○","○","○","○","○","○","○","×","○","○","○","○","○","○","○","○","○","○","○","○","○","○","○","○","○","×","○","○","○","○","○","×","○","○","○","○","○","○","×","○","○","○","○","○","○","○","○","○","○","○","○","○","○","○","○","×","○","○","○","○","○","○","○","○","○","○","○","○","○","○","○","○","○","○","○","○","×","○","○","○","○","○","○","○","○","×","○",null,"A",null,null,null,null,null,"ファイル形式","ファイル形式の設定を行う。\n(スキャンプロファイルにて設定)",null,null,null,1,"0001",0,0,0,1]
["63-7",null,null,"○","○","○","○","○","○","○","○","○","○","○","○","○","○","○","○","○","○","○","○","○","○","○","○","○","○","○","○","○","○","○","○","○","○","○","○","○","○","○","○","○","○","○","○","○","○","○","○","○","○","○","○","○","○","○","○","○","○","○","○","○","○","○","○","○","○","○","○","○","○","○","○","○","○","○","○","○","○","○","○","○","○","○","○","○","○","○","○","○","○","○","○","○","○","○","○","○","","○","","○","","○","","○","","○","","○","","○","","○","","○","","○","","○","","○","","○","","○","","○","","○","","○","","○","○","○","○","○","○","○","○","○","○","○","○","○","○","○","○","○","○","○","○","○","○","○","○","○","○","○","○","○","○","○","○","○","○","○","○","○","○","○","○","○","○","○","○","○","○","○","○","○","○","○","○","○","○","○","○","○","○","○","○","○","○","○","○","○","○","○","○","○","○","○","○","○","○","○","○","○","○","○","○","○","○","○","○","○","○","○","○","○","○","○","○","○","○","○","○","○","○","○","○","○","○","○","○","○","○","○","○","○","○","○","○","○","○","○","○","○","○","○","○","○","○","○","○","○","○","○","○","○","○","○","○","○","○","○","○","○","○","○","○","○","○","○","○","○","○","○","○","○","○","○","○","○","○","○","○","○","○","○","○","○","○","○","○","○","○","○","○","○","○","○","○","×","○","○","○","○","○","○","○","○","○","○","×","○","○","○","○","○","○","○","○","○","○","○","○","○","○","○","○","×","○","○","○","○","○","○","○","○","○","○","○","○","○","○","×","○","○","○","○","○","○","○","○","○","○","○","○","○","×","○","○","○","○","○","○","○","○","○","○","○","○","○","○","○","○","×","○","○","○","○","○","○","○","○","○","○","○","○","○","○","×","○","○","○","○","○","○","○","○","○","○","○","○","○","○","○","○","×","○","○","○","○","○","○","○","○","○","○","○","○","○","○","×","○","○","○","○","○","○","○","○","○","○","○","○","○","○","○","○","×","○","○","○","○","○","○","○","○","○","○","○","○","○","○","○","○","×","○","○","○","○","○","○","○","○","○","○","○","○","○","○","○","○","×","○","○","○","○","○","○","○","○","○","○","○","○","○","○","×","○","○","○","○","○","○","○","○","○","○","○","○","○","○","○","○","×","○","○","○","○","○","○","○","○","○","○","○","○","○","○","○","○","○","×","○","○","○","○","○","×","○","○","○","○","○","○","×","○","○","○","○","○","○","○","○","○","○","○","○","○","○","○","○","×","○","○","○","○","○","○","○","○","○","○","○","○","○","○","○","○","○","○","○","○","×","○","○","○","○","○","○","○","○","×","○",null,"A",null,null,null,null,null,"解像度","解像度の設定を行う。\n(スキャンプロファイルにて設定)",null,null,null,1,"0001",0,0,0,1]
[null,null,null,"○","×","×","×","×","×","×","×","×","×","×","×","×","×","×","×","×","×","×","×","×","×","×","×","×","×","×","×","×","×","×","×","×","×","×","×","×","×","×","×","×","×","×","×","×","×","×","×","×","×","×","×","×","×","×","×","×","×","×","×","×","×","×","×","×","×","×","×","×","×","×","×","×","×","×","×","×","×","×","×","×","×","×","×","×","×","×","×","×","×","×","×","×","×","×","×","×",null,"×",null,"×",null,"×",null,"×",null,"×",null,"×",null,"×",null,"×",null,"×",null,"×",null,"×",null,"×",null,"×",null,"×",null,"×",null,"×",null,"×",null,"×","×","×","○","○","○","○","○","○","○","○","○","○","○","○","○","○","○","○","○","○","○","○","○","○","○","○","○","○","○","○","○","○","○","○","○","○","○","○","○","○","○","○","○","○","○","○","○","○","○","○","○","○","○","○","○","○","○","○","○","○","○","○","○","○","○","○","○","○","○","○","○","○","○","○","○","○","○","○","○","○","○","○","○","○","○","○","○","○","○","○","○","○","○","○","○","○","○","○","○","○","○","○","○","○","○","○","○","○","○","○","○","○","○","○","○","○","○","○","○","○","○","○","○","○","○","○","○","○","○","○","○","○","○","○","○","○","○","○","○","○","○","○","○","○","○","○","○","○","○","○","○","○","○","○","○","○","○","○","○","○","○","○","○","○","○","○","○","○","○","○","○","×","○","○","○","○","○","○","○","○","○","○","×","○","○","○","○","○","○","○","○","○","○","○","○","○","○","○","○","×","○","○","○","○","○","○","○","○","○","○","○","○","○","○","×","○","○","○","○","○","○","○","○","○","○","○","○","○","×","○","○","○","○","○","○","○","○","○","○","○","○","○","○","○","○","×","○","○","○","○","○","○","○","○","○","○","○","○","○","○","×","○","○","○","○","○","○","○","○","○","○","○","○","○","○","○","○","×","○","○","○","○","○","○","○","○","○","○","○","○","○","○","×","○","○","○","○","○","○","○","○","○","○","○","○","○","○","○","○","×","○","○","○","○","○","○","○","○","○","○","○","○","○","○","○","○","×","○","○","○","○","○","○","○","○","○","○","○","○","○","○","○","○","×","○","○","○","○","○","○","○","○","○","○","○","○","○","○","×","○","○","○","○","○","○","○","○","○","○","○","○","○","○","○","○","×","○","○","○","○","○","○","○","○","○","○","○","○","○","○","○","○","○","×","○","○","○","○","○","×","○","○","○","○","○","○","×","○","○","○","○","○","○","○","○","○","○","○","○","○","○","○","○","×","○","○","○","○","○","○","○","○","○","○","○","○","○","○","○","○","○","○","○","○","×","○","○","○","○","○","○","○","○","×","○",null,"A",null,null,null,null,"9）Panel Link スキャン(*2)(*3)","参照\nRQ-232_10_システム連携機能.xls\n2.基本的な操作動作",null,"(*4)",null,null,1,"0001",0,0,0,1,null,null,null,null,null,null,null,null,null,null,null,null,null,null,null,null,null,null,null,null,null,null,null,null,null,null,null,null,"○",null,"○",null,null,null,null,null,"○"]
[64,null,null,"○","○","○","○","○","○","○","○","○","○","○","○","○","○","○","○","○","○","○","○","○","○","○","○","○","○","○","○","○","○","○","○","○","○","○","○","○","○","○","○","○","○","○","○","○","○","○","○","○","○","○","○","○","○","○","○","○","○","○","○","○","○","○","○","○","○","○","○","○","○","○","○","○","○","○","○","○","○","○","○","○","○","○","○","○","○","○","○","○","○","○","○","○","○","○","○","○","","○","","○","","○","","○","","○","","○","","○","","○","","○","","○","","○","","○","","○","","○","","○","","○","","○","","○","○","○","○","○","○","○","○","○","○","○","○","○","○","○","○","○","○","○","○","○","○","○","○","○","○","○","○","○","○","○","○","○","○","○","○","○","○","○","○","○","○","○","○","○","○","○","○","○","○","○","○","○","○","○","○","○","○","○","○","○","○","○","○","○","○","○","○","○","○","○","○","○","○","○","○","○","○","○","○","○","○","○","○","○","○","○","○","○","○","○","○","○","○","○","○","○","○","○","○","○","○","○","○","○","○","○","○","○","○","○","○","○","○","○","○","○","○","○","○","○","○","○","○","○","○","○","○","○","○","○","○","○","○","○","○","○","○","○","○","○","○","○","○","○","○","○","○","○","○","○","○","○","○","○","○","○","○","○","○","○","○","○","○","○","○","○","○","○","○","○","○","×","○","○","○","○","○","○","○","○","○","○","×","○","○","○","○","○","○","○","○","○","○","○","○","○","○","○","○","×","○","○","○","○","○","○","○","○","○","○","○","○","○","○","×","○","○","○","○","○","○","○","○","○","○","○","○","○","×","○","○","○","○","○","○","○","○","○","○","○","○","○","○","○","○","×","○","○","○","○","○","○","○","○","○","○","○","○","○","○","×","○","○","○","○","○","○","○","○","○","○","○","○","○","○","○","○","×","○","○","○","○","○","○","○","○","○","○","○","○","○","○","×","○","○","○","○","○","○","○","○","○","○","○","○","○","○","○","○","×","○","○","○","○","○","○","○","○","○","○","○","○","○","○","○","○","×","○","○","○","○","○","○","○","○","○","○","○","○","○","○","○","○","×","○","○","○","○","○","○","○","○","○","○","○","○","○","○","×","○","○","○","○","○","○","○","○","○","○","○","○","○","○","○","○","×","○","○","○","○","○","○","○","○","○","○","○","○","○","○","○","○","○","×","○","○","○","○","○","×","○","○","○","○","○","○","×","○","○","○","○","○","○","○","○","○","○","○","○","○","○","○","○","×","○","○","○","○","○","○","○","○","○","○","○","○","○","○","○","○","○","○","○","○","×","○","○","○","○","○","○","○","○","×","○",null,"A",null,null,"【参　　考】\n(評価対象外)","PSLとはPageScopeLightの略であり、PageScopeLightとは、ブラウザ上から一般ユーザが利用可能な、ミノルタ製デバイス管理ソフトウェアである",null,"\n",null,null,null,null,1,"0001",0,0,0,1,null,null,"PSL is an abbreviation of PageScopeLight.  \nThe PageScopeLight is a public user accessible software on a browser used for device management manufactured by MINOLTA. ",null,"\n"]
[65,null,null,"○","○","○","○","○","○","○","○","○","○","○","○","○","○","○","○","○","○","○","○","○","○","○","○","○","○","○","○","○","○","○","○","○","○","○","○","○","○","○","○","○","○","○","○","○","○","○","○","○","○","○","○","○","○","○","○","○","○","○","○","○","○","○","○","○","○","○","○","○","○","○","○","○","○","○","○","○","○","○","○","○","○","○","○","○","○","○","○","○","○","○","○","○","○","○","○","○","","○","","○","","○","","○","","○","","○","","○","","○","","○","","○","","○","","○","","○","","○","","○","","○","","○","","○","○","○","○","○","○","○","○","○","○","○","○","○","○","○","○","○","○","○","○","○","○","○","○","○","○","○","○","○","○","○","○","○","○","○","○","○","○","○","○","○","○","○","○","○","○","○","○","○","○","○","○","○","○","○","○","○","○","○","○","○","○","○","○","○","○","○","○","○","○","○","○","○","○","○","○","○","○","○","○","○","○","○","○","○","○","○","○","○","○","○","○","○","○","○","○","○","○","○","○","○","○","○","○","○","○","○","○","○","○","○","○","○","○","○","○","○","○","○","○","○","○","○","○","○","○","○","○","○","○","○","○","○","○","○","○","○","○","○","○","○","○","○","○","○","○","○","○","○","○","○","○","○","○","○","○","○","○","○","○","○","○","○","○","○","○","○","○","○","○","○","○","×","○","○","○","○","○","○","○","○","○","○","×","○","○","○","○","○","○","○","○","○","○","○","○","○","○","○","○","×","○","○","○","○","○","○","○","○","○","○","○","○","○","○","×","○","○","○","○","○","○","○","○","○","○","○","○","○","×","○","○","○","○","○","○","○","○","○","○","○","○","○","○","○","○","×","○","○","○","○","○","○","○","○","○","○","○","○","○","○","×","○","○","○","○","○","○","○","○","○","○","○","○","○","○","○","○","×","○","○","○","○","○","○","○","○","○","○","○","○","○","○","×","○","○","○","○","○","○","○","○","○","○","○","○","○","○","○","○","×","○","○","○","○","○","○","○","○","○","○","○","○","○","○","○","○","×","○","○","○","○","○","○","○","○","○","○","○","○","○","○","○","○","×","○","○","○","○","○","○","○","○","○","○","○","○","○","○","×","○","○","○","○","○","○","○","○","○","○","○","○","○","○","○","○","×","○","○","○","○","○","○","○","○","○","○","○","○","○","○","○","○","○","×","○","○","○","○","○","×","○","○","○","○","○","○","×","○","○","○","○","○","○","○","○","○","○","○","○","○","○","○","○","×","○","○","○","○","○","○","○","○","○","○","○","○","○","○","○","○","○","○","○","○","×","○","○","○","○","○","○","○","○","×","○",null,"A",null,null,"【メ　　モ】\n(評価対象外)",null,null,null,null,null,null,null,1,"0001",0,0,0,1]
[66,null,null,"×","－","－","－","－","－","－","－","－","－","－","－","－","－","－","－","－","－","－","－","－","－","－","－","－","－","－","－","－","－","－","－","－","－","－","－","－","－","－","－","－","－","－","－","－","－","－","－","－","－","－","－","－","－","－","－","－","－","－","－","－","－","－","－","－","－","－","－","－","－","－","－","－","－","－","－","－","－","－","－","－","－","－","－","－","－","－","－","－","－","－","－","－","－","－","－","－","","－","","－","","－","","－","","－","","－","","－","","－","","－","","－","","－","","－","","－","","－","","－","","－","","－","","－","－","－","－","－","－","－","－","－","－","－","－","－","－","－","－","－","－","－","－","－","－","－","－","－","－","－","－","－","－","－","－","－","－","－","－","－","－","－","－","－","－","－","－","－","－","－","－","－","－","－","－","－","－","－","－","－","－","－","－","－","－","－","－","－","－","－","－","－","－","－","－","－","－","－","－","－","－","－","－","－","－","－","－","－","－","－","－","－","－","－","－","－","－","－","－","－","－","－","－","－","－","－","－","－","－","－","－","－","－","－","－","－","－","－","－","－","－","－","－","－","－","－","－","－","－","－","－","－","－","－","－","－","－","－","－","－","－","－","－","－","－","－","－","－","－","－","－","－","－","－","－","－","－","－","－","－","－","－","－","－","－","－","－","－","－","－","－","－","－","－","－","－","－","－","－","－","－","－","－","－","－","－","－","－","－","－","－","－","－","－","－","－","－","－","－","－","－","－","－","－","－","－","－","－","－","－","－","－","－","－","－","－","－","－","－","－","－","－","－","－","－","－","－","－","－","－","－","－","－","－","－","－","－","－","－","－","－","－","－","－","－","－","－","－","－","－","－","－","－","－","－","－","－","－","－","－","－","－","－","－","－","－","－","－","－","－","－","－","－","－","－","－","－","－","－","－","－","－","－","－","－","－","－","－","－","－","－","－","－","－","－","－","－","－","－","－","－","－","－","－","－","－","－","－","－","－","－","－","－","－","－","－","－","－","－","－","－","－","－","－","－","－","－","－","－","－","－","－","－","－","－","－","－","－","－","－","－","－","－","－","－","－","－","－","－","－","－","－","－","－","－","－","－","－","－","－","－","－","－","－","－","－","－","－","－","－","－","－","－","－","－","－","－","－","－","－","－","－","－","－","－","－","－","－","－","－","－","－","－","－","－","－","－","－","－","－","－","－","－","－","－","－","－","－","－","－","－","－","－","－","－","－","－","－","－","－","－","－","－","－","－","－","－","－","－","－","－","－","－","－","－","－","－","－","－","－","－","－","－","－","－","－","－","－","－","－","－","－","－","－","－","－","－","－","－",null,"-","-","-","【履　　歴】\n(評価対象外)","2003/09/03 初版　松田",null,null,null,null,null,null,1,"0001",0,0,0,1,null,null,"Initial edition prepared by Matsuda on September 3, 2003",null,null,null,null,null,null,null,null,null,null,null,null,null,"○"]
["66-2",null,null,"×","－","－","－","－","－","－","－","－","－","－","－","－","－","－","－","－","－","－","－","－","－","－","－","－","－","－","－","－","－","－","－","－","－","－","－","－","－","－","－","－","－","－","－","－","－","－","－","－","－","－","－","－","－","－","－","－","－","－","－","－","－","－","－","－","－","－","－","－","－","－","－","－","－","－","－","－","－","－","－","－","－","－","－","－","－","－","－","－","－","－","－","－","－","－","－","－","","－","","－","","－","","－","","－","","－","","－","","－","","－","","－","","－","","－","","－","","－","","－","","－","","－","","－","－","－","－","－","－","－","－","－","－","－","－","－","－","－","－","－","－","－","－","－","－","－","－","－","－","－","－","－","－","－","－","－","－","－","－","－","－","－","－","－","－","－","－","－","－","－","－","－","－","－","－","－","－","－","－","－","－","－","－","－","－","－","－","－","－","－","－","－","－","－","－","－","－","－","－","－","－","－","－","－","－","－","－","－","－","－","－","－","－","－","－","－","－","－","－","－","－","－","－","－","－","－","－","－","－","－","－","－","－","－","－","－","－","－","－","－","－","－","－","－","－","－","－","－","－","－","－","－","－","－","－","－","－","－","－","－","－","－","－","－","－","－","－","－","－","－","－","－","－","－","－","－","－","－","－","－","－","－","－","－","－","－","－","－","－","－","－","－","－","－","－","－","－","－","－","－","－","－","－","－","－","－","－","－","－","－","－","－","－","－","－","－","－","－","－","－","－","－","－","－","－","－","－","－","－","－","－","－","－","－","－","－","－","－","－","－","－","－","－","－","－","－","－","－","－","－","－","－","－","－","－","－","－","－","－","－","－","－","－","－","－","－","－","－","－","－","－","－","－","－","－","－","－","－","－","－","－","－","－","－","－","－","－","－","－","－","－","－","－","－","－","－","－","－","－","－","－","－","－","－","－","－","－","－","－","－","－","－","－","－","－","－","－","－","－","－","－","－","－","－","－","－","－","－","－","－","－","－","－","－","－","－","－","－","－","－","－","－","－","－","－","－","－","－","－","－","－","－","－","－","－","－","－","－","－","－","－","－","－","－","－","－","－","－","－","－","－","－","－","－","－","－","－","－","－","－","－","－","－","－","－","－","－","－","－","－","－","－","－","－","－","－","－","－","－","－","－","－","－","－","－","－","－","－","－","－","－","－","－","－","－","－","－","－","－","－","－","－","－","－","－","－","－","－","－","－","－","－","－","－","－","－","－","－","－","－","－","－","－","－","－","－","－","－","－","－","－","－","－","－","－","－","－","－","－","－","－","－","－","－","－","－","－","－","－","－","－","－","－","－","－","－","－","－","－",null,"-","-","-",null,"2003/10/31 03（D)版　柴田",null,null,null,null,null,null,null,"","","","","",null,null,"03 rd (D) edition prepared by Shibata on October 31, 2003\n",null,null,null,null,null,null,null,null,null,null,null,null,null,"○"]
["66-3",null,null,"×","－","－","－","－","－","－","－","－","－","－","－","－","－","－","－","－","－","－","－","－","－","－","－","－","－","－","－","－","－","－","－","－","－","－","－","－","－","－","－","－","－","－","－","－","－","－","－","－","－","－","－","－","－","－","－","－","－","－","－","－","－","－","－","－","－","－","－","－","－","－","－","－","－","－","－","－","－","－","－","－","－","－","－","－","－","－","－","－","－","－","－","－","－","－","－","－","","－","","－","","－","","－","","－","","－","","－","","－","","－","","－","","－","","－","","－","","－","","－","","－","","－","","－","－","－","－","－","－","－","－","－","－","－","－","－","－","－","－","－","－","－","－","－","－","－","－","－","－","－","－","－","－","－","－","－","－","－","－","－","－","－","－","－","－","－","－","－","－","－","－","－","－","－","－","－","－","－","－","－","－","－","－","－","－","－","－","－","－","－","－","－","－","－","－","－","－","－","－","－","－","－","－","－","－","－","－","－","－","－","－","－","－","－","－","－","－","－","－","－","－","－","－","－","－","－","－","－","－","－","－","－","－","－","－","－","－","－","－","－","－","－","－","－","－","－","－","－","－","－","－","－","－","－","－","－","－","－","－","－","－","－","－","－","－","－","－","－","－","－","－","－","－","－","－","－","－","－","－","－","－","－","－","－","－","－","－","－","－","－","－","－","－","－","－","－","－","－","－","－","－","－","－","－","－","－","－","－","－","－","－","－","－","－","－","－","－","－","－","－","－","－","－","－","－","－","－","－","－","－","－","－","－","－","－","－","－","－","－","－","－","－","－","－","－","－","－","－","－","－","－","－","－","－","－","－","－","－","－","－","－","－","－","－","－","－","－","－","－","－","－","－","－","－","－","－","－","－","－","－","－","－","－","－","－","－","－","－","－","－","－","－","－","－","－","－","－","－","－","－","－","－","－","－","－","－","－","－","－","－","－","－","－","－","－","－","－","－","－","－","－","－","－","－","－","－","－","－","－","－","－","－","－","－","－","－","－","－","－","－","－","－","－","－","－","－","－","－","－","－","－","－","－","－","－","－","－","－","－","－","－","－","－","－","－","－","－","－","－","－","－","－","－","－","－","－","－","－","－","－","－","－","－","－","－","－","－","－","－","－","－","－","－","－","－","－","－","－","－","－","－","－","－","－","－","－","－","－","－","－","－","－","－","－","－","－","－","－","－","－","－","－","－","－","－","－","－","－","－","－","－","－","－","－","－","－","－","－","－","－","－","－","－","－","－","－","－","－","－","－","－","－","－","－","－","－","－","－","－","－","－","－","－","－","－","－","－","－","－","－","－","－","－","－","－","－","－","－","－",null,"-","-","-",null,"2004/03/12　改訂　市木","(*1)LaPlataは、RealModeTWAIN機能無し。",null,null,null,null,null,null,"","","","","",null,null,"Revised by Ichiki on March 12, 2004","(*1)LaPlata has no RealModeTWAIN function.",null,null,null,null,null,null,null,null,null,null,null,null,"○"]
["66-3",null,null,"×","－","－","－","－","－","－","－","－","－","－","－","－","－","－","－","－","－","－","－","－","－","－","－","－","－","－","－","－","－","－","－","－","－","－","－","－","－","－","－","－","－","－","－","－","－","－","－","－","－","－","－","－","－","－","－","－","－","－","－","－","－","－","－","－","－","－","－","－","－","－","－","－","－","－","－","－","－","－","－","－","－","－","－","－","－","－","－","－","－","－","－","－","－","－","－","－","","－","","－","","－","","－","","－","","－","","－","","－","","－","","－","","－","","－","","－","","－","","－","","－","","－","","－","－","－","－","－","－","－","－","－","－","－","－","－","－","－","－","－","－","－","－","－","－","－","－","－","－","－","－","－","－","－","－","－","－","－","－","－","－","－","－","－","－","－","－","－","－","－","－","－","－","－","－","－","－","－","－","－","－","－","－","－","－","－","－","－","－","－","－","－","－","－","－","－","－","－","－","－","－","－","－","－","－","－","－","－","－","－","－","－","－","－","－","－","－","－","－","－","－","－","－","－","－","－","－","－","－","－","－","－","－","－","－","－","－","－","－","－","－","－","－","－","－","－","－","－","－","－","－","－","－","－","－","－","－","－","－","－","－","－","－","－","－","－","－","－","－","－","－","－","－","－","－","－","－","－","－","－","－","－","－","－","－","－","－","－","－","－","－","－","－","－","－","－","－","－","－","－","－","－","－","－","－","－","－","－","－","－","－","－","－","－","－","－","－","－","－","－","－","－","－","－","－","－","－","－","－","－","－","－","－","－","－","－","－","－","－","－","－","－","－","－","－","－","－","－","－","－","－","－","－","－","－","－","－","－","－","－","－","－","－","－","－","－","－","－","－","－","－","－","－","－","－","－","－","－","－","－","－","－","－","－","－","－","－","－","－","－","－","－","－","－","－","－","－","－","－","－","－","－","－","－","－","－","－","－","－","－","－","－","－","－","－","－","－","－","－","－","－","－","－","－","－","－","－","－","－","－","－","－","－","－","－","－","－","－","－","－","－","－","－","－","－","－","－","－","－","－","－","－","－","－","－","－","－","－","－","－","－","－","－","－","－","－","－","－","－","－","－","－","－","－","－","－","－","－","－","－","－","－","－","－","－","－","－","－","－","－","－","－","－","－","－","－","－","－","－","－","－","－","－","－","－","－","－","－","－","－","－","－","－","－","－","－","－","－","－","－","－","－","－","－","－","－","－","－","－","－","－","－","－","－","－","－","－","－","－","－","－","－","－","－","－","－","－","－","－","－","－","－","－","－","－","－","－","－","－","－","－","－","－","－","－","－","－","－","－","－","－","－","－","－","－","－","－","－","－",null,"-","-","-",null,"2007/12/07　改訂　制御11開　中村","WSDスキャン機能を追加しました。",null,null,null,null,null,1,"0001",0,0,0,1,null,null,null,null,null,null,null,null,null,null,null,null,null,null,null,null,"○"]
[null,null,null,"×","－","－","－","－","－","－","－","－","－","－","－","－","－","－","－","－","－","－","－","－","－","－","－","－","－","－","－","－","－","－","－","－","－","－","－","－","－","－","－","－","－","－","－","－","－","－","－","－","－","－","－","－","－","－","－","－","－","－","－","－","－","－","－","－","－","－","－","－","－","－","－","－","－","－","－","－","－","－","－","－","－","－","－","－","－","－","－","－","－","－","－","－","－","－","－","－","","－","","－","","－","","－","","－","","－","","－","","－","","－","","－","","－","","－","","－","","－","","－","","－","","－","","－","－","－","－","－","－","－","－","－","－","－","－","－","－","－","－","－","－","－","－","－","－","－","－","－","－","－","－","－","－","－","－","－","－","－","－","－","－","－","－","－","－","－","－","－","－","－","－","－","－","－","－","－","－","－","－","－","－","－","－","－","－","－","－","－","－","－","－","－","－","－","－","－","－","－","－","－","－","－","－","－","－","－","－","－","－","－","－","－","－","－","－","－","－","－","－","－","－","－","－","－","－","－","－","－","－","－","－","－","－","－","－","－","－","－","－","－","－","－","－","－","－","－","－","－","－","－","－","－","－","－","－","－","－","－","－","－","－","－","－","－","－","－","－","－","－","－","－","－","－","－","－","－","－","－","－","－","－","－","－","－","－","－","－","－","－","－","－","－","－","－","－","－","－","－","－","－","－","－","－","－","－","－","－","－","－","－","－","－","－","－","－","－","－","－","－","－","－","－","－","－","－","－","－","－","－","－","－","－","－","－","－","－","－","－","－","－","－","－","－","－","－","－","－","－","－","－","－","－","－","－","－","－","－","－","－","－","－","－","－","－","－","－","－","－","－","－","－","－","－","－","－","－","－","－","－","－","－","－","－","－","－","－","－","－","－","－","－","－","－","－","－","－","－","－","－","－","－","－","－","－","－","－","－","－","－","－","－","－","－","－","－","－","－","－","－","－","－","－","－","－","－","－","－","－","－","－","－","－","－","－","－","－","－","－","－","－","－","－","－","－","－","－","－","－","－","－","－","－","－","－","－","－","－","－","－","－","－","－","－","－","－","－","－","－","－","－","－","－","－","－","－","－","－","－","－","－","－","－","－","－","－","－","－","－","－","－","－","－","－","－","－","－","－","－","－","－","－","－","－","－","－","－","－","－","－","－","－","－","－","－","－","－","－","－","－","－","－","－","－","－","－","－","－","－","－","－","－","－","－","－","－","－","－","－","－","－","－","－","－","－","－","－","－","－","－","－","－","－","－","－","－","－","－","－","－","－","－","－","－","－","－","－","－","－","－","－","－","－","－","－","－","－","－","－","－",null,"-","-","-",null,"2014/8/27　改訂　1OPS小野","(*2)ZeusS対応　RQ-232 bizhubRAにScanToAndroid追加対応",null,null,null,null,null,1,"0001",0,0,0,1]
[null,null,null,"×","－","－","－","－","－","－","－","－","－","－","－","－","－","－","－","－","－","－","－","－","－","－","－","－","－","－","－","－","－","－","－","－","－","－","－","－","－","－","－","－","－","－","－","－","－","－","－","－","－","－","－","－","－","－","－","－","－","－","－","－","－","－","－","－","－","－","－","－","－","－","－","－","－","－","－","－","－","－","－","－","－","－","－","－","－","－","－","－","－","－","－","－","－","－","－","－","","－","","－","","－","","－","","－","","－","","－","","－","","－","","－","","－","","－","","－","","－","","－","","－","","－","","－","－","－","－","－","－","－","－","－","－","－","－","－","－","－","－","－","－","－","－","－","－","－","－","－","－","－","－","－","－","－","－","－","－","－","－","－","－","－","－","－","－","－","－","－","－","－","－","－","－","－","－","－","－","－","－","－","－","－","－","－","－","－","－","－","－","－","－","－","－","－","－","－","－","－","－","－","－","－","－","－","－","－","－","－","－","－","－","－","－","－","－","－","－","－","－","－","－","－","－","－","－","－","－","－","－","－","－","－","－","－","－","－","－","－","－","－","－","－","－","－","－","－","－","－","－","－","－","－","－","－","－","－","－","－","－","－","－","－","－","－","－","－","－","－","－","－","－","－","－","－","－","－","－","－","－","－","－","－","－","－","－","－","－","－","－","－","－","－","－","－","－","－","－","－","－","－","－","－","－","－","－","－","－","－","－","－","－","－","－","－","－","－","－","－","－","－","－","－","－","－","－","－","－","－","－","－","－","－","－","－","－","－","－","－","－","－","－","－","－","－","－","－","－","－","－","－","－","－","－","－","－","－","－","－","－","－","－","－","－","－","－","－","－","－","－","－","－","－","－","－","－","－","－","－","－","－","－","－","－","－","－","－","－","－","－","－","－","－","－","－","－","－","－","－","－","－","－","－","－","－","－","－","－","－","－","－","－","－","－","－","－","－","－","－","－","－","－","－","－","－","－","－","－","－","－","－","－","－","－","－","－","－","－","－","－","－","－","－","－","－","－","－","－","－","－","－","－","－","－","－","－","－","－","－","－","－","－","－","－","－","－","－","－","－","－","－","－","－","－","－","－","－","－","－","－","－","－","－","－","－","－","－","－","－","－","－","－","－","－","－","－","－","－","－","－","－","－","－","－","－","－","－","－","－","－","－","－","－","－","－","－","－","－","－","－","－","－","－","－","－","－","－","－","－","－","－","－","－","－","－","－","－","－","－","－","－","－","－","－","－","－","－","－","－","－","－","－","－","－","－","－","－","－","－","－","－","－","－","－","－","－","－","－","－","－","－","－","－","－","－","－","－","－","－","－",null,"-","-","-",null,"2014/11/20　改訂　1OPS小野","(*3)ZeusS対応\nCQ505895対応　RQ-232ワーディング整合の結果反映\n「ScanToAndroid」⇒「Panel Link スキャン」に機能名称を修正。",null,null,null,null,null,1,"0001",0,0,0,1,null,null,null,null,null,null,null,null,null,null,null,null,null,null,null,null,null,null,null,null,null,null,null,null,null,null,null,null,null,null,"○"]
[null,null,null,"×","－","－","－","－","－","－","－","－","－","－","－","－","－","－","－","－","－","－","－","－","－","－","－","－","－","－","－","－","－","－","－","－","－","－","－","－","－","－","－","－","－","－","－","－","－","－","－","－","－","－","－","－","－","－","－","－","－","－","－","－","－","－","－","－","－","－","－","－","－","－","－","－","－","－","－","－","－","－","－","－","－","－","－","－","－","－","－","－","－","－","－","－","－","－","－","－","","－","","－","","－","","－","","－","","－","","－","","－","","－","","－","","－","","－","","－","","－","","－","","－","","－","","－","－","－","－","－","－","－","－","－","－","－","－","－","－","－","－","－","－","－","－","－","－","－","－","－","－","－","－","－","－","－","－","－","－","－","－","－","－","－","－","－","－","－","－","－","－","－","－","－","－","－","－","－","－","－","－","－","－","－","－","－","－","－","－","－","－","－","－","－","－","－","－","－","－","－","－","－","－","－","－","－","－","－","－","－","－","－","－","－","－","－","－","－","－","－","－","－","－","－","－","－","－","－","－","－","－","－","－","－","－","－","－","－","－","－","－","－","－","－","－","－","－","－","－","－","－","－","－","－","－","－","－","－","－","－","－","－","－","－","－","－","－","－","－","－","－","－","－","－","－","－","－","－","－","－","－","－","－","－","－","－","－","－","－","－","－","－","－","－","－","－","－","－","－","－","－","－","－","－","－","－","－","－","－","－","－","－","－","－","－","－","－","－","－","－","－","－","－","－","－","－","－","－","－","－","－","－","－","－","－","－","－","－","－","－","－","－","－","－","－","－","－","－","－","－","－","－","－","－","－","－","－","－","－","－","－","－","－","－","－","－","－","－","－","－","－","－","－","－","－","－","－","－","－","－","－","－","－","－","－","－","－","－","－","－","－","－","－","－","－","－","－","－","－","－","－","－","－","－","－","－","－","－","－","－","－","－","－","－","－","－","－","－","－","－","－","－","－","－","－","－","－","－","－","－","－","－","－","－","－","－","－","－","－","－","－","－","－","－","－","－","－","－","－","－","－","－","－","－","－","－","－","－","－","－","－","－","－","－","－","－","－","－","－","－","－","－","－","－","－","－","－","－","－","－","－","－","－","－","－","－","－","－","－","－","－","－","－","－","－","－","－","－","－","－","－","－","－","－","－","－","－","－","－","－","－","－","－","－","－","－","－","－","－","－","－","－","－","－","－","－","－","－","－","－","－","－","－","－","－","－","－","－","－","－","－","－","－","－","－","－","－","－","－","－","－","－","－","－","－","－","－","－","－","－","－","－","－","－","－","－","－","－","－","－","－","－","－","－","－","－","－","－","－","－","－",null,"-","-","-",null,"2015/10/16 改訂 1OPS近藤\n","ZeusS Z/X/0対応\n(*4)機種適用欄空欄リファイン対応\nDonau1(基本)、Poseidon 1(基本)でグルーピングされている機種適用欄を空欄から「×」に修正。",null,null,null,null,null,1,"0001",0,0,0,1,null,null,null,null,null,null,null,null,null,null,null,null,null,null,null,null,null,null,null,null,null,null,null,null,null,null,null,null,null,null,null,null,null,null,null,null,"○"]
[null,null,null,"×","－","－","－","－","－","－","－","－","－","－","－","－","－","－","－","－","－","－","－","－","－","－","－","－","－","－","－","－","－","－","－","－","－","－","－","－","－","－","－","－","－","－","－","－","－","－","－","－","－","－","－","－","－","－","－","－","－","－","－","－","－","－","－","－","－","－","－","－","－","－","－","－","－","－","－","－","－","－","－","－","－","－","－","－","－","－","－","－","－","－","－","－","－","－","－","－","","－","","－","","－","","－","","－","","－","","－","","－","","－","","－","","－","","－","","－","","－","","－","","－","","－","","－","－","－","－","－","－","－","－","－","－","－","－","－","－","－","－","－","－","－","－","－","－","－","－","－","－","－","－","－","－","－","－","－","－","－","－","－","－","－","－","－","－","－","－","－","－","－","－","－","－","－","－","－","－","－","－","－","－","－","－","－","－","－","－","－","－","－","－","－","－","－","－","－","－","－","－","－","－","－","－","－","－","－","－","－","－","－","－","－","－","－","－","－","－","－","－","－","－","－","－","－","－","－","－","－","－","－","－","－","－","－","－","－","－","－","－","－","－","－","－","－","－","－","－","－","－","－","－","－","－","－","－","－","－","－","－","－","－","－","－","－","－","－","－","－","－","－","－","－","－","－","－","－","－","－","－","－","－","－","－","－","－","－","－","－","－","－","－","－","－","－","－","－","－","－","－","－","－","－","－","－","－","－","－","－","－","－","－","－","－","－","－","－","－","－","－","－","－","－","－","－","－","－","－","－","－","－","－","－","－","－","－","－","－","－","－","－","－","－","－","－","－","－","－","－","－","－","－","－","－","－","－","－","－","－","－","－","－","－","－","－","－","－","－","－","－","－","－","－","－","－","－","－","－","－","－","－","－","－","－","－","－","－","－","－","－","－","－","－","－","－","－","－","－","－","－","－","－","－","－","－","－","－","－","－","－","－","－","－","－","－","－","－","－","－","－","－","－","－","－","－","－","－","－","－","－","－","－","－","－","－","－","－","－","－","－","－","－","－","－","－","－","－","－","－","－","－","－","－","－","－","－","－","－","－","－","－","－","－","－","－","－","－","－","－","－","－","－","－","－","－","－","－","－","－","－","－","－","－","－","－","－","－","－","－","－","－","－","－","－","－","－","－","－","－","－","－","－","－","－","－","－","－","－","－","－","－","－","－","－","－","－","－","－","－","－","－","－","－","－","－","－","－","－","－","－","－","－","－","－","－","－","－","－","－","－","－","－","－","－","－","－","－","－","－","－","－","－","－","－","－","－","－","－","－","－","－","－","－","－","－","－","－","－","－","－","－","－","－","－","－","－","－","－","－","－",null,"-","-","-",null,"2016/4/1 改訂　神谷","Icarus対応\n(*5)制御29_HDDﾚｽ対応(QA82549)\nIcarus機種摘要欄を「×」に修正。",null,null,null,null,null,1,"0001",0,0,0,1,null,null,null,null,null,null,null,null,null,null,null,null,null,null,null,null,null,null,null,null,null,null,null,null,null,null,null,null,null,null,null,null,null,null,null,null,null,null,null,null,null,null,"○"]
[67,null,null,"×","○","○","○","○","○","○","○","○","○","○","○","○","○","○","○","○","○","○","○","○","○","○","○","○","○","○","○","○","○","○","○","○","○","○","○","○","○","○","○","○","○","○","○","○","○","○","○","○","○","○","○","○","○","○","○","○","○","○","○","○","○","○","○","○","○","○","○","○","○","○","○","○","○","○","○","○","○","○","○","○","○","○","○","○","○","○","○","○","○","○","○","○","○","○","○","○","","○","","○","","○","","○","","○","","○","","○","","○","","○","","○","","○","","○","","○","","○","","○","","○","","○","","○","○","○","○","○","○","○","○","○","○","○","○","○","○","○","○","○","○","○","○","○","○","○","○","○","○","○","○","○","○","○","○","○","○","○","○","○","○","○","○","○","○","○","○","○","○","○","○","○","○","○","○","○","○","○","○","○","○","○","○","○","○","○","○","○","○","○","○","○","○","○","○","○","○","○","○","○","○","○","○","○","○","○","○","○","○","○","○","○","○","○","○","○","○","○","○","○","○","○","○","○","○","○","○","○","○","○","○","○","○","○","○","○","○","○","○","○","○","○","○","○","○","○","○","○","○","○","○","○","○","○","○","○","○","○","○","○","○","○","○","○","○","○","○","○","○","○","○","○","○","○","○","○","○","○","○","○","○","○","○","○","○","○","○","○","○","○","○","○","○","○","○","×","○","○","○","○","○","○","○","○","○","○","×","○","○","○","○","○","○","○","○","○","○","○","○","○","○","○","○","×","○","○","○","○","○","○","○","○","○","○","○","○","○","○","×","○","○","○","○","○","○","○","○","○","○","○","○","○","×","○","○","○","○","○","○","○","○","○","○","○","○","○","○","○","○","×","○","○","○","○","○","○","○","○","○","○","○","○","○","○","×","○","○","○","○","○","○","○","○","○","○","○","○","○","○","○","○","×","○","○","○","○","○","○","○","○","○","○","○","○","○","○","×","○","○","○","○","○","○","○","○","○","○","○","○","○","○","○","○","×","○","○","○","○","○","○","○","○","○","○","○","○","○","○","○","○","×","○","○","○","○","○","○","○","○","○","○","○","○","○","○","○","○","×","○","○","○","○","○","○","○","○","○","○","○","○","○","○","×","○","○","○","○","○","○","○","○","○","○","○","○","○","○","○","○","×","○","○","○","○","○","○","○","○","○","○","○","○","○","○","○","○","○","×","○","○","○","○","○","×","○","○","○","○","○","○","×","○","○","○","○","○","○","○","○","○","○","○","○","○","○","○","○","×","○","○","○","○","○","○","○","○","○","○","○","○","○","○","○","○","○","○","○","○","×","○","○","○","○","○","○","○","○","×","○",null,"-","-","-",null,null,null,null,null,null,null,null,null,"","","","","",null,null,null,null,null,null,null,null,null,null,null,null,null,null,null,null,"○"]
[68,"1.2.システム構成と操作ストーリー：本体起動スキャン","ScanToE-mail","○","○","○","○","○","○","○","○","○","○","○","○","○","○","○","○","○","○","○","○","○","○","○","○","○","○","○","○","○","○","○","○","○","○","○","○","○","○","○","○","○","○","○","○","○","○","○","○","○","○","○","○","○","○","○","○","○","○","○","○","○","○","○","○","○","○","○","○","○","○","○","○","○","○","○","○","○","○","○","○","○","○","○","○","○","○","○","○","○","○","○","○","○","○","○","○","○","","○","","○","","○","","○","","○","","○","","○","","○","","○","","○","","○","","○","","○","","○","","○","","○","","○","","○","○","○","○","○","○","○","○","○","○","○","○","○","○","○","○","○","○","○","○","○","○","○","○","○","○","○","○","○","○","○","○","○","○","○","○","○","○","○","○","○","○","○","○","○","○","○","○","○","○","○","○","○","○","○","○","○","○","○","○","○","○","○","○","○","○","○","○","○","○","○","○","○","○","○","○","○","○","○","○","○","○","○","○","○","○","○","○","○","○","○","○","○","○","○","○","○","○","○","○","○","○","○","○","○","○","○","○","○","○","○","○","○","○","○","○","○","○","○","○","○","○","○","○","○","○","○","○","○","○","○","○","○","○","○","○","○","○","○","○","○","○","○","○","○","○","○","○","○","○","○","○","○","○","○","○","○","○","○","○","○","○","○","○","○","○","○","○","○","○","○","○","×","○","○","○","○","○","○","○","○","○","○","×","○","○","○","○","○","○","○","○","○","○","○","○","○","○","○","○","×","○","○","○","○","○","○","○","○","○","○","○","○","○","○","×","○","○","○","○","○","○","○","○","○","○","○","○","○","×","○","○","○","○","○","○","○","○","○","○","○","○","○","○","○","○","×","○","○","○","○","○","○","○","○","○","○","○","○","○","○","×","○","○","○","○","○","○","○","○","○","○","○","○","○","○","○","○","×","○","○","○","○","○","○","○","○","○","○","○","○","○","○","×","○","○","○","○","○","○","○","○","○","○","○","○","○","○","○","○","×","○","○","○","○","○","○","○","○","○","○","○","○","○","○","○","○","×","○","○","○","○","○","○","○","○","○","○","○","○","○","○","○","○","×","○","○","○","○","○","○","○","○","○","○","○","○","○","○","×","○","○","○","○","○","○","○","○","○","○","○","○","○","○","○","○","×","○","○","○","○","○","○","○","○","○","○","○","○","○","○","○","○","○","×","○","○","○","○","○","×","○","○","○","○","○","○","×","○","○","○","○","○","○","○","○","○","○","○","○","○","○","○","○","×","○","○","○","○","○","○","○","○","○","○","○","○","○","○","○","○","○","○","○","○","×","○","○","○","○","○","○","○","○","×","○",null,"A",null,null,"【文書番号】",null,null,null,null,null,null,null,1,"0001",0,0,0,1]
[69,null,null,"○","○","○","○","○","○","○","○","○","○","○","○","○","○","○","○","○","○","○","○","○","○","○","○","○","○","○","○","○","○","○","○","○","○","○","○","○","○","○","○","○","○","○","○","○","○","○","○","○","○","○","○","○","○","○","○","○","○","○","○","○","○","○","○","○","○","○","○","○","○","○","○","○","○","○","○","○","○","○","○","○","○","○","○","○","○","○","○","○","○","○","○","○","○","○","○","○","","○","","○","","○","","○","","○","","○","","○","","○","","○","","○","","○","","○","","○","","○","","○","","○","","○","","○","○","○","○","○","○","○","○","○","○","○","○","○","○","○","○","○","○","○","○","○","○","○","○","○","○","○","○","○","○","○","○","○","○","○","○","○","○","○","○","○","○","○","○","○","○","○","○","○","○","○","○","○","○","○","○","○","○","○","○","○","○","○","○","○","○","○","○","○","○","○","○","○","○","○","○","○","○","○","○","○","○","○","○","○","○","○","○","○","○","○","○","○","○","○","○","○","○","○","○","○","○","○","○","○","○","○","○","○","○","○","○","○","○","○","○","○","○","○","○","○","○","○","○","○","○","○","○","○","○","○","○","○","○","○","○","○","○","○","○","○","○","○","○","○","○","○","○","○","○","○","○","○","○","○","○","○","○","○","○","○","○","○","○","○","○","○","○","○","○","○","○","×","○","○","○","○","○","○","○","○","○","○","×","○","○","○","○","○","○","○","○","○","○","○","○","○","○","○","○","×","○","○","○","○","○","○","○","○","○","○","○","○","○","○","×","○","○","○","○","○","○","○","○","○","○","○","○","○","×","○","○","○","○","○","○","○","○","○","○","○","○","○","○","○","○","×","○","○","○","○","○","○","○","○","○","○","○","○","○","○","×","○","○","○","○","○","○","○","○","○","○","○","○","○","○","○","○","×","○","○","○","○","○","○","○","○","○","○","○","○","○","○","×","○","○","○","○","○","○","○","○","○","○","○","○","○","○","○","○","×","○","○","○","○","○","○","○","○","○","○","○","○","○","○","○","○","×","○","○","○","○","○","○","○","○","○","○","○","○","○","○","○","○","×","○","○","○","○","○","○","○","○","○","○","○","○","○","○","×","○","○","○","○","○","○","○","○","○","○","○","○","○","○","○","○","×","○","○","○","○","○","○","○","○","○","○","○","○","○","○","○","○","○","×","○","○","○","○","○","×","○","○","○","○","○","○","×","○","○","○","○","○","○","○","○","○","○","○","○","○","○","○","○","×","○","○","○","○","○","○","○","○","○","○","○","○","○","○","○","○","○","○","○","○","×","○","○","○","○","○","○","○","○","×","○",null,"A",null,null,"【機　　能】","ScanToE-mailにおけるシステム構成と提供機能の使い方を示す\n",null,null,null,null,null,null,1,"0001",0,0,0,1,null,null,"System configuration and how to use an offered function of ScanToE-mail.\n"]
[70,null,null,"○","○","○","○","○","○","○","○","○","○","○","○","○","○","○","○","○","○","○","○","○","○","○","○","○","○","○","○","○","○","○","○","○","○","○","○","○","○","○","○","○","○","○","○","○","○","○","○","○","○","○","○","○","○","○","○","○","○","○","○","○","○","○","○","○","○","○","○","○","○","○","○","○","○","○","○","○","○","○","○","○","○","○","○","○","○","○","○","○","○","○","○","○","○","○","○","○","","○","","○","","○","","○","","○","","○","","○","","○","","○","","○","","○","","○","","○","","○","","○","","○","","○","","○","○","○","○","○","○","○","○","○","○","○","○","○","○","○","○","○","○","○","○","○","○","○","○","○","○","○","○","○","○","○","○","○","○","○","○","○","○","○","○","○","○","○","○","○","○","○","○","○","○","○","○","○","○","○","○","○","○","○","○","○","○","○","○","○","○","○","○","○","○","○","○","○","○","○","○","○","○","○","○","○","○","○","○","○","○","○","○","○","○","○","○","○","○","○","○","○","○","○","○","○","○","○","○","○","○","○","○","○","○","○","○","○","○","○","○","○","○","○","○","○","○","○","○","○","○","○","○","○","○","○","○","○","○","○","○","○","○","○","○","○","○","○","○","○","○","○","○","○","○","○","○","○","○","○","○","○","○","○","○","○","○","○","○","○","○","○","○","○","○","○","○","×","○","○","○","○","○","○","○","○","○","○","×","○","○","○","○","○","○","○","○","○","○","○","○","○","○","○","○","×","○","○","○","○","○","○","○","○","○","○","○","○","○","○","×","○","○","○","○","○","○","○","○","○","○","○","○","○","×","○","○","○","○","○","○","○","○","○","○","○","○","○","○","○","○","×","○","○","○","○","○","○","○","○","○","○","○","○","○","○","×","○","○","○","○","○","○","○","○","○","○","○","○","○","○","○","○","×","○","○","○","○","○","○","○","○","○","○","○","○","○","○","×","○","○","○","○","○","○","○","○","○","○","○","○","○","○","○","○","×","○","○","○","○","○","○","○","○","○","○","○","○","○","○","○","○","×","○","○","○","○","○","○","○","○","○","○","○","○","○","○","○","○","×","○","○","○","○","○","○","○","○","○","○","○","○","○","○","×","○","○","○","○","○","○","○","○","○","○","○","○","○","○","○","○","×","○","○","○","○","○","○","○","○","○","○","○","○","○","○","○","○","○","×","○","○","○","○","○","×","○","○","○","○","○","○","×","○","○","○","○","○","○","○","○","○","○","○","○","○","○","○","○","×","○","○","○","○","○","○","○","○","○","○","○","○","○","○","○","○","○","○","○","○","×","○","○","○","○","○","○","○","○","×","○",null,"A",null,null,"【受付条件】",null,null,null,null,null,null,null,1,"0001",0,0,0,1]
[71,null,null,"○","○","○","○","○","○","○","○","○","○","○","○","○","○","○","○","○","○","○","○","○","○","○","○","○","○","○","○","○","○","○","○","○","○","○","○","○","○","○","○","○","○","○","○","○","○","○","○","○","○","○","○","○","○","○","○","○","○","○","○","○","○","○","○","○","○","○","○","○","○","○","○","○","○","○","○","○","○","○","○","○","○","○","○","○","○","○","○","○","○","○","○","○","○","○","○","○","","○","","○","","○","","○","","○","","○","","○","","○","","○","","○","","○","","○","","○","","○","","○","","○","","○","","○","○","○","○","○","○","○","○","○","○","○","○","○","○","○","○","○","○","○","○","○","○","○","○","○","○","○","○","○","○","○","○","○","○","○","○","○","○","○","○","○","○","○","○","○","○","○","○","○","○","○","○","○","○","○","○","○","○","○","○","○","○","○","○","○","○","○","○","○","○","○","○","○","○","○","○","○","○","○","○","○","○","○","○","○","○","○","○","○","○","○","○","○","○","○","○","○","○","○","○","○","○","○","○","○","○","○","○","○","○","○","○","○","○","○","○","○","○","○","○","○","○","○","○","○","○","○","○","○","○","○","○","○","○","○","○","○","○","○","○","○","○","○","○","○","○","○","○","○","○","○","○","○","○","○","○","○","○","○","○","○","○","○","○","○","○","○","○","○","○","○","○","×","○","○","○","○","○","○","○","○","○","○","×","○","○","○","○","○","○","○","○","○","○","○","○","○","○","○","○","×","○","○","○","○","○","○","○","○","○","○","○","○","○","○","×","○","○","○","○","○","○","○","○","○","○","○","○","○","×","○","○","○","○","○","○","○","○","○","○","○","○","○","○","○","○","×","○","○","○","○","○","○","○","○","○","○","○","○","○","○","×","○","○","○","○","○","○","○","○","○","○","○","○","○","○","○","○","×","○","○","○","○","○","○","○","○","○","○","○","○","○","○","×","○","○","○","○","○","○","○","○","○","○","○","○","○","○","○","○","×","○","○","○","○","○","○","○","○","○","○","○","○","○","○","○","○","×","○","○","○","○","○","○","○","○","○","○","○","○","○","○","○","○","×","○","○","○","○","○","○","○","○","○","○","○","○","○","○","×","○","○","○","○","○","○","○","○","○","○","○","○","○","○","○","○","×","○","○","○","○","○","○","○","○","○","○","○","○","○","○","○","○","○","×","○","○","○","○","○","×","○","○","○","○","○","○","×","○","○","○","○","○","○","○","○","○","○","○","○","○","○","○","○","×","○","○","○","○","○","○","○","○","○","○","○","○","○","○","○","○","○","○","○","○","×","○","○","○","○","○","○","○","○","×","○",null,"A",null,null,"【詳　　細】",null,null,null,null,null,null,null,1,"0001",0,0,0,1]
[72,null,null,"○","○","○","○","○","○","○","○","○","○","○","○","○","○","○","○","○","○","○","○","○","○","○","○","○","○","○","○","○","○","○","○","○","○","○","○","○","○","○","○","○","○","○","○","○","○","○","○","○","○","○","○","○","○","○","○","○","○","○","○","○","○","○","○","○","○","○","○","○","○","○","○","○","○","○","○","○","○","○","○","○","○","○","○","○","○","○","○","○","○","○","○","○","○","○","○","○","","○","","○","","○","","○","","○","","○","","○","","○","","○","","○","","○","","○","","○","","○","","○","","○","","○","","○","○","○","○","○","○","○","○","○","○","○","○","○","○","○","○","○","○","○","○","○","○","○","○","○","○","○","○","○","○","○","○","○","○","○","○","○","○","○","○","○","○","○","○","○","○","○","○","○","○","○","○","○","○","○","○","○","○","○","○","○","○","○","○","○","○","○","○","○","○","○","○","○","○","○","○","○","○","○","○","○","○","○","○","○","○","○","○","○","○","○","○","○","○","○","○","○","○","○","○","○","○","○","○","○","○","○","○","○","○","○","○","○","○","○","○","○","○","○","○","○","○","○","○","○","○","○","○","○","○","○","○","○","○","○","○","○","○","○","○","○","○","○","○","○","○","○","○","○","○","○","○","○","○","○","○","○","○","○","○","○","○","○","○","○","○","○","○","○","○","○","○","×","○","○","○","○","○","○","○","○","○","○","×","○","○","○","○","○","○","○","○","○","○","○","○","○","○","○","○","×","○","○","○","○","○","○","○","○","○","○","○","○","○","○","×","○","○","○","○","○","○","○","○","○","○","○","○","○","×","○","○","○","○","○","○","○","○","○","○","○","○","○","○","○","○","×","○","○","○","○","○","○","○","○","○","○","○","○","○","○","×","○","○","○","○","○","○","○","○","○","○","○","○","○","○","○","○","×","○","○","○","○","○","○","○","○","○","○","○","○","○","○","×","○","○","○","○","○","○","○","○","○","○","○","○","○","○","○","○","×","○","○","○","○","○","○","○","○","○","○","○","○","○","○","○","○","×","○","○","○","○","○","○","○","○","○","○","○","○","○","○","○","○","×","○","○","○","○","○","○","○","○","○","○","○","○","○","○","×","○","○","○","○","○","○","○","○","○","○","○","○","○","○","○","○","×","○","○","○","○","○","○","○","○","○","○","○","○","○","○","○","○","○","×","○","○","○","○","○","×","○","○","○","○","○","○","×","○","○","○","○","○","○","○","○","○","○","○","○","○","○","○","○","×","○","○","○","○","○","○","○","○","○","○","○","○","○","○","○","○","○","○","○","○","×","○","○","○","○","○","○","○","○","×","○",null,"A",null,null,null,null,null,null,null,null,null,null,null,"","","","",""]
[73,null,null,"○","○","○","○","○","○","○","○","○","○","○","○","○","○","○","○","○","○","○","○","○","○","○","○","○","○","○","○","○","○","○","○","○","○","○","○","○","○","○","○","○","○","○","○","○","○","○","○","○","○","○","○","○","○","○","○","○","○","○","○","○","○","○","○","○","○","○","○","○","○","○","○","○","○","○","○","○","○","○","○","○","○","○","○","○","○","○","○","○","○","○","○","○","○","○","○","○","","○","","○","","○","","○","","○","","○","","○","","○","","○","","○","","○","","○","","○","","○","","○","","○","","○","","○","○","○","○","○","○","○","○","○","○","○","○","○","○","○","○","○","○","○","○","○","○","○","○","○","○","○","○","○","○","○","○","○","○","○","○","○","○","○","○","○","○","○","○","○","○","○","○","○","○","○","○","○","○","○","○","○","○","○","○","○","○","○","○","○","○","○","○","○","○","○","○","○","○","○","○","○","○","○","○","○","○","○","○","○","○","○","○","○","○","○","○","○","○","○","○","○","○","○","○","○","○","○","○","○","○","○","○","○","○","○","○","○","○","○","○","○","○","○","○","○","○","○","○","○","○","○","○","○","○","○","○","○","○","○","○","○","○","○","○","○","○","○","○","○","○","○","○","○","○","○","○","○","○","○","○","○","○","○","○","○","○","○","○","○","○","○","○","○","○","○","○","×","○","○","○","○","○","○","○","○","○","○","×","○","○","○","○","○","○","○","○","○","○","○","○","○","○","○","○","×","○","○","○","○","○","○","○","○","○","○","○","○","○","○","×","○","○","○","○","○","○","○","○","○","○","○","○","○","×","○","○","○","○","○","○","○","○","○","○","○","○","○","○","○","○","×","○","○","○","○","○","○","○","○","○","○","○","○","○","○","×","○","○","○","○","○","○","○","○","○","○","○","○","○","○","○","○","×","○","○","○","○","○","○","○","○","○","○","○","○","○","○","×","○","○","○","○","○","○","○","○","○","○","○","○","○","○","○","○","×","○","○","○","○","○","○","○","○","○","○","○","○","○","○","○","○","×","○","○","○","○","○","○","○","○","○","○","○","○","○","○","○","○","×","○","○","○","○","○","○","○","○","○","○","○","○","○","○","×","○","○","○","○","○","○","○","○","○","○","○","○","○","○","○","○","×","○","○","○","○","○","○","○","○","○","○","○","○","○","○","○","○","○","×","○","○","○","○","○","×","○","○","○","○","○","○","×","○","○","○","○","○","○","○","○","○","○","○","○","○","○","○","○","×","○","○","○","○","○","○","○","○","○","○","○","○","○","○","○","○","○","○","○","○","×","○","○","○","○","○","○","○","○","×","○",null,"A",null,null,"【参　　考】\n(評価対象外)",null,null,null,null,null,null,null,1,"0001",0,0,0,1]
[null,null,null,"○","×","×","×","×","×","×","×","×","×","×","×","×","×","×","×","×","×","×","×","×","×","×","×","×","×","×","×","×","×","×","×","×","×","×","×","×","×","×","×","×","×","×","×","×","×","×","×","×","×","×","×","×","×","×","×","×","×","×","×","×","×","×","×","×","×","×","×","×","×","×","×","×","×","×","×","×","×","×","×","×","×","×","×","×","×","×","×","×","×","×","×","×","×","×","×","×",null,"×",null,"×",null,"×",null,"×",null,"×",null,"×",null,"×",null,"×",null,"×",null,"×",null,"×",null,"×",null,"×",null,"×",null,"×",null,"×",null,"×",null,"×","×","×","×","×","×","×","×","×","○","○","○","○","○","○","○","○","○","○","○","○","○","○","○","○","○","○","○","○","○","○","○","○","○","○","○","○","○","○","○","×","×","×","×","×","×","×","×","×","×","×","×","×","×","×","×","×","×","×","×","×","×","×","×","×","×","×","×","×","×","×","×","×","×","×","×","×","×","×","×","×","×","×","×","×","×","×","×","×","×","×","×","×","×","×","×","×","×","×","×","×","×","×","×","×","×","×","×","×","×","×","×","×","×","×","×","×","×","×","×","×","×","×","×","×","×","×","×","×","×","×","×","×","×","×","×","×","×","×","×","×","×","×","×","×","×","×","×","×","×","×","×","×","×","×","×","×","×","×","×","×","×","×","×","×","×","×","×","×","×","×","×","×","×","×","×","×","×","×","×","×","×","×","×","×","×","×","×","×","×","×","×","×","×","×","×","×","×","×","×","×","×","×","×","×","×","×","×","×","×","×","×","×","×","×","×","×","×","×","×","×","×","×","×","×","×","×","×","×","×","×","×","×","×","×","×","×","×","×","×","×","×","×","×","×","×","×","×","×","×","×","×","×","×","×","×","×","×","×","×","×","×","×","×","×","×","×","×","×","×","×","×","×","×","×","×","×","×","×","×","×","×","×","×","×","×","×","×","×","×","×","×","×","×","×","×","×","×","×","×","×","×","×","×","×","×","×","×","×","×","×","×","×","×","×","×","×","×","×","×","×","×","×","×","×","×","×","×","×","×","×","×","×","×","×","×","×","×","×","×","×","×","×","×","×","×","×","×","×","×","×","×","×","×","×","×","×","×","×","×","×","×","×","×","×","×","×","×","×","×","×","×","×","×","×","×","×","×","×","×","×","×","×","×","×","×","×","×","×","×","×","×","×","×","×","×","×","×","×","×","×","×","×","×","×","×","×","×","×","×","×","×","×","×","×","×","×","×","×","×","×","×","×","×","×","×","×","×","×","×","×","×","×","×","×","×","×","×","×","×","×","×","×","×","×","×","×","×","×","×","×","×","×","×","×","×",null,"△","△","△",null,"※特Rom対応\n<MZ2ND-54>\nScan to Email時に送信するドメインを制限する対応",null,null,null,"(*1)(*3)(*5)(*7)(*8)",null,null,1,"0001",0,0,0,1,null,null,null,null,null,null,null,null,null,null,null,null,null,null,null,null,null,null,null,null,null,null,null,null,null,null,null,null,null,null,null,"○",null,null,"○",null,null,"○","○",null,"○"]
[null,null,null,"○","×","×","×","×","×","×","×","×","×","×","×","×","×","×","×","×","×","×","×","×","×","×","×","×","×","×","×","×","×","×","×","×","×","×","×","×","×","×","×","×","×","×","×","×","×","×","×","×","×","×","×","×","×","×","×","×","×","×","×","×","×","×","×","×","×","×","×","×","×","×","×","×","×","×","×","×","×","×","×","×","×","×","×","×","×","×","×","×","×","×","×","×","×","×","×","×",null,"×",null,"×",null,"×",null,"×",null,"×",null,"×",null,"×",null,"×",null,"×",null,"×",null,"×",null,"×",null,"×",null,"×",null,"×",null,"×",null,"×",null,"×","×","×","×","×","×","×","×","×","○","○","○","○","○","○","○","○","○","○","○","○","○","○","○","○","○","○","○","○","○","○","○","○","○","○","○","○","○","○","○","×","×","×","×","×","×","×","×","×","×","×","×","×","×","×","×","×","×","×","×","×","×","×","×","×","×","×","×","×","×","×","×","×","×","×","×","×","×","×","×","×","×","×","×","×","×","×","×","×","×","×","×","×","×","×","×","×","×","×","×","×","×","×","×","×","×","×","×","×","×","×","×","×","×","×","×","×","×","×","×","×","×","×","×","×","×","×","×","×","×","×","×","×","×","×","×","×","×","×","×","×","×","×","×","×","×","×","×","×","×","×","×","×","×","×","×","×","×","×","×","×","×","×","×","×","×","×","×","×","×","×","×","×","×","×","×","×","×","×","×","×","×","×","×","×","×","×","×","×","×","×","×","×","×","×","×","×","×","×","×","×","×","×","×","×","×","×","×","×","×","×","×","×","×","×","×","×","×","×","×","×","×","×","×","×","×","×","×","×","×","×","×","×","×","×","×","×","×","×","×","×","×","×","×","×","×","×","×","×","×","×","×","×","×","×","×","×","×","×","×","×","×","×","×","×","×","×","×","×","×","×","×","×","×","×","×","×","×","×","×","×","×","×","×","×","×","×","×","×","×","×","×","×","×","×","×","×","×","×","×","×","×","×","×","×","×","×","×","×","×","×","×","×","×","×","×","×","×","×","×","×","×","×","×","×","×","×","×","×","×","×","×","×","×","×","×","×","×","×","×","×","×","×","×","×","×","×","×","×","×","×","×","×","×","×","×","×","×","×","×","×","×","×","×","×","×","×","×","×","×","×","×","×","×","×","×","×","×","×","×","×","×","×","×","×","×","×","×","×","×","×","×","×","×","×","×","×","×","×","×","×","×","×","×","×","×","×","×","×","×","×","×","×","×","×","×","×","×","×","×","×","×","×","×","×","×","×","×","×","×","×","×","×","×","×","×","×","×","×","×","×","×","×","×","×","×","×","×","×","×","×","×","×","×","×","×",null,"△","△","△",null,"DipSWNo.201 bit7が有効(ON)の場合、以下の動作とする。",null,null,null,"(*5)",null,null,1,"0001",0,0,0,1,null,null,null,null,null,null,null,null,null,null,null,null,null,null,null,null,null,null,null,null,null,null,null,null,null,null,null,null,null,null,null,"○",null,null,"○",null,"○","○","○",null,"○"]
[null,null,null,"○","×","×","×","×","×","×","×","×","×","×","×","×","×","×","×","×","×","×","×","×","×","×","×","×","×","×","×","×","×","×","×","×","×","×","×","×","×","×","×","×","×","×","×","×","×","×","×","×","×","×","×","×","×","×","×","×","×","×","×","×","×","×","×","×","×","×","×","×","×","×","×","×","×","×","×","×","×","×","×","×","×","×","×","×","×","×","×","×","×","×","×","×","×","×","×","×",null,"×",null,"×",null,"×",null,"×",null,"×",null,"×",null,"×",null,"×",null,"×",null,"×",null,"×",null,"×",null,"×",null,"×",null,"×",null,"×",null,"×",null,"×","×","×","×","×","×","×","×","×","○","○","○","○","○","○","○","○","○","○","○","○","○","○","○","○","○","○","○","○","○","○","○","○","○","○","○","○","○","○","○","×","×","×","×","×","×","×","×","×","×","×","×","×","×","×","×","×","×","×","×","×","×","×","×","×","×","×","×","×","×","×","×","×","×","×","×","×","×","×","×","×","×","×","×","×","×","×","×","×","×","×","×","×","×","×","×","×","×","×","×","×","×","×","×","×","×","×","×","×","×","×","×","×","×","×","×","×","×","×","×","×","×","×","×","×","×","×","×","×","×","×","×","×","×","×","×","×","×","×","×","×","×","×","×","×","×","×","×","×","×","×","×","×","×","×","×","×","×","×","×","×","×","×","×","×","×","×","×","×","×","×","×","×","×","×","×","×","×","×","×","×","×","×","×","×","×","×","×","×","×","×","×","×","×","×","×","×","×","×","×","×","×","×","×","×","×","×","×","×","×","×","×","×","×","×","×","×","×","×","×","×","×","×","×","×","×","×","×","×","×","×","×","×","×","×","×","×","×","×","×","×","×","×","×","×","×","×","×","×","×","×","×","×","×","×","×","×","×","×","×","×","×","×","×","×","×","×","×","×","×","×","×","×","×","×","×","×","×","×","×","×","×","×","×","×","×","×","×","×","×","×","×","×","×","×","×","×","×","×","×","×","×","×","×","×","×","×","×","×","×","×","×","×","×","×","×","×","×","×","×","×","×","×","×","×","×","×","×","×","×","×","×","×","×","×","×","×","×","×","×","×","×","×","×","×","×","×","×","×","×","×","×","×","×","×","×","×","×","×","×","×","×","×","×","×","×","×","×","×","×","×","×","×","×","×","×","×","×","×","×","×","×","×","×","×","×","×","×","×","×","×","×","×","×","×","×","×","×","×","×","×","×","×","×","×","×","×","×","×","×","×","×","×","×","×","×","×","×","×","×","×","×","×","×","×","×","×","×","×","×","×","×","×","×","×","×","×","×","×","×","×","×","×","×","×","×","×","×","×","×","×","×","×","×","×","×",null,"△","△","△",null,null,"メールアドレスに、送信拒否ドメインに設定されているドメイン名が含まれる場合",null,null,"送信拒否ドメインについては、\n「06_ユーティリティ（ネットワーク設定）.xlsx」 > [ネットワーク設定(IT5以降)] > ＜E-mail設定＞ > E-mail送信拒否\nを参照\n(*4)(*5)",null,null,1,"0001",0,0,0,1,null,null,null,null,null,null,null,null,null,null,null,null,null,null,null,null,null,null,null,null,null,null,null,null,null,null,null,null,null,null,null,"○",null,null,"○",null,"○","○","○",null,"○"]
[null,null,null,"○","×","×","×","×","×","×","×","×","×","×","×","×","×","×","×","×","×","×","×","×","×","×","×","×","×","×","×","×","×","×","×","×","×","×","×","×","×","×","×","×","×","×","×","×","×","×","×","×","×","×","×","×","×","×","×","×","×","×","×","×","×","×","×","×","×","×","×","×","×","×","×","×","×","×","×","×","×","×","×","×","×","×","×","×","×","×","×","×","×","×","×","×","×","×","×","×",null,"×",null,"×",null,"×",null,"×",null,"×",null,"×",null,"×",null,"×",null,"×",null,"×",null,"×",null,"×",null,"×",null,"×",null,"×",null,"×",null,"×",null,"×","×","×","×","×","×","×","×","×","○","○","○","○","○","○","○","○","○","○","○","○","○","○","○","○","○","○","○","○","○","○","○","○","○","○","○","○","○","○","○","×","×","×","×","×","×","×","×","×","×","×","×","×","×","×","×","×","×","×","×","×","×","×","×","×","×","×","×","×","×","×","×","×","×","×","×","×","×","×","×","×","×","×","×","×","×","×","×","×","×","×","×","×","×","×","×","×","×","×","×","×","×","×","×","×","×","×","×","×","×","×","×","×","×","×","×","×","×","×","×","×","×","×","×","×","×","×","×","×","×","×","×","×","×","×","×","×","×","×","×","×","×","×","×","×","×","×","×","×","×","×","×","×","×","×","×","×","×","×","×","×","×","×","×","×","×","×","×","×","×","×","×","×","×","×","×","×","×","×","×","×","×","×","×","×","×","×","×","×","×","×","×","×","×","×","×","×","×","×","×","×","×","×","×","×","×","×","×","×","×","×","×","×","×","×","×","×","×","×","×","×","×","×","×","×","×","×","×","×","×","×","×","×","×","×","×","×","×","×","×","×","×","×","×","×","×","×","×","×","×","×","×","×","×","×","×","×","×","×","×","×","×","×","×","×","×","×","×","×","×","×","×","×","×","×","×","×","×","×","×","×","×","×","×","×","×","×","×","×","×","×","×","×","×","×","×","×","×","×","×","×","×","×","×","×","×","×","×","×","×","×","×","×","×","×","×","×","×","×","×","×","×","×","×","×","×","×","×","×","×","×","×","×","×","×","×","×","×","×","×","×","×","×","×","×","×","×","×","×","×","×","×","×","×","×","×","×","×","×","×","×","×","×","×","×","×","×","×","×","×","×","×","×","×","×","×","×","×","×","×","×","×","×","×","×","×","×","×","×","×","×","×","×","×","×","×","×","×","×","×","×","×","×","×","×","×","×","×","×","×","×","×","×","×","×","×","×","×","×","×","×","×","×","×","×","×","×","×","×","×","×","×","×","×","×","×","×","×","×","×","×","×","×","×","×","×","×","×","×","×","×","×","×","×","×","×",null,"△","△","△",null,null,null,"パネルから手動宛先入力時",null,"(*4)(*5)",null,null,1,"0001",0,0,0,1,null,null,null,null,null,null,null,null,null,null,null,null,null,null,null,null,null,null,null,null,null,null,null,null,null,null,null,null,null,null,null,"○",null,null,"○",null,"○","○","○",null,"○"]
[null,null,null,"○","×","×","×","×","×","×","×","×","×","×","×","×","×","×","×","×","×","×","×","×","×","×","×","×","×","×","×","×","×","×","×","×","×","×","×","×","×","×","×","×","×","×","×","×","×","×","×","×","×","×","×","×","×","×","×","×","×","×","×","×","×","×","×","×","×","×","×","×","×","×","×","×","×","×","×","×","×","×","×","×","×","×","×","×","×","×","×","×","×","×","×","×","×","×","×","×",null,"×",null,"×",null,"×",null,"×",null,"×",null,"×",null,"×",null,"×",null,"×",null,"×",null,"×",null,"×",null,"×",null,"×",null,"×",null,"×",null,"×",null,"×","×","×","×","×","×","×","×","×","○","○","○","○","○","○","○","○","○","○","○","○","○","○","○","○","○","○","○","○","○","○","○","○","○","○","○","○","○","○","○","×","×","×","×","×","×","×","×","×","×","×","×","×","×","×","×","×","×","×","×","×","×","×","×","×","×","×","×","×","×","×","×","×","×","×","×","×","×","×","×","×","×","×","×","×","×","×","×","×","×","×","×","×","×","×","×","×","×","×","×","×","×","×","×","×","×","×","×","×","×","×","×","×","×","×","×","×","×","×","×","×","×","×","×","×","×","×","×","×","×","×","×","×","×","×","×","×","×","×","×","×","×","×","×","×","×","×","×","×","×","×","×","×","×","×","×","×","×","×","×","×","×","×","×","×","×","×","×","×","×","×","×","×","×","×","×","×","×","×","×","×","×","×","×","×","×","×","×","×","×","×","×","×","×","×","×","×","×","×","×","×","×","×","×","×","×","×","×","×","×","×","×","×","×","×","×","×","×","×","×","×","×","×","×","×","×","×","×","×","×","×","×","×","×","×","×","×","×","×","×","×","×","×","×","×","×","×","×","×","×","×","×","×","×","×","×","×","×","×","×","×","×","×","×","×","×","×","×","×","×","×","×","×","×","×","×","×","×","×","×","×","×","×","×","×","×","×","×","×","×","×","×","×","×","×","×","×","×","×","×","×","×","×","×","×","×","×","×","×","×","×","×","×","×","×","×","×","×","×","×","×","×","×","×","×","×","×","×","×","×","×","×","×","×","×","×","×","×","×","×","×","×","×","×","×","×","×","×","×","×","×","×","×","×","×","×","×","×","×","×","×","×","×","×","×","×","×","×","×","×","×","×","×","×","×","×","×","×","×","×","×","×","×","×","×","×","×","×","×","×","×","×","×","×","×","×","×","×","×","×","×","×","×","×","×","×","×","×","×","×","×","×","×","×","×","×","×","×","×","×","×","×","×","×","×","×","×","×","×","×","×","×","×","×","×","×","×","×","×","×","×","×","×","×","×","×","×","×","×","×","×","×","×","×","×","×",null,"△","△","△",null,null,null,null,"送信不可とする。","(*4)(*5)",null,null,1,"0001",0,0,0,1,null,null,null,null,null,null,null,null,null,null,null,null,null,null,null,null,null,null,null,null,null,null,null,null,null,null,null,null,null,null,null,"○",null,null,"○",null,"○","○","○",null,"○"]
[null,null,null,"○","×","×","×","×","×","×","×","×","×","×","×","×","×","×","×","×","×","×","×","×","×","×","×","×","×","×","×","×","×","×","×","×","×","×","×","×","×","×","×","×","×","×","×","×","×","×","×","×","×","×","×","×","×","×","×","×","×","×","×","×","×","×","×","×","×","×","×","×","×","×","×","×","×","×","×","×","×","×","×","×","×","×","×","×","×","×","×","×","×","×","×","×","×","×","×","×",null,"×",null,"×",null,"×",null,"×",null,"×",null,"×",null,"×",null,"×",null,"×",null,"×",null,"×",null,"×",null,"×",null,"×",null,"×",null,"×",null,"×",null,"×","×","×","×","×","×","×","×","×","○","○","○","○","○","○","○","○","○","○","○","○","○","○","○","○","○","○","○","○","○","○","○","○","○","○","○","○","○","○","○","×","×","×","×","×","×","×","×","×","×","×","×","×","×","×","×","×","×","×","×","×","×","×","×","×","×","×","×","×","×","×","×","×","×","×","×","×","×","×","×","×","×","×","×","×","×","×","×","×","×","×","×","×","×","×","×","×","×","×","×","×","×","×","×","×","×","×","×","×","×","×","×","×","×","×","×","×","×","×","×","×","×","×","×","×","×","×","×","×","×","×","×","×","×","×","×","×","×","×","×","×","×","×","×","×","×","×","×","×","×","×","×","×","×","×","×","×","×","×","×","×","×","×","×","×","×","×","×","×","×","×","×","×","×","×","×","×","×","×","×","×","×","×","×","×","×","×","×","×","×","×","×","×","×","×","×","×","×","×","×","×","×","×","×","×","×","×","×","×","×","×","×","×","×","×","×","×","×","×","×","×","×","×","×","×","×","×","×","×","×","×","×","×","×","×","×","×","×","×","×","×","×","×","×","×","×","×","×","×","×","×","×","×","×","×","×","×","×","×","×","×","×","×","×","×","×","×","×","×","×","×","×","×","×","×","×","×","×","×","×","×","×","×","×","×","×","×","×","×","×","×","×","×","×","×","×","×","×","×","×","×","×","×","×","×","×","×","×","×","×","×","×","×","×","×","×","×","×","×","×","×","×","×","×","×","×","×","×","×","×","×","×","×","×","×","×","×","×","×","×","×","×","×","×","×","×","×","×","×","×","×","×","×","×","×","×","×","×","×","×","×","×","×","×","×","×","×","×","×","×","×","×","×","×","×","×","×","×","×","×","×","×","×","×","×","×","×","×","×","×","×","×","×","×","×","×","×","×","×","×","×","×","×","×","×","×","×","×","×","×","×","×","×","×","×","×","×","×","×","×","×","×","×","×","×","×","×","×","×","×","×","×","×","×","×","×","×","×","×","×","×","×","×","×","×","×","×","×","×","×","×","×","×","×","×","×",null,"△","△","△",null,null,null,"パネルから短縮宛先登録時",null,"(*4)(*5)",null,null,1,"0001",0,0,0,1,null,null,null,null,null,null,null,null,null,null,null,null,null,null,null,null,null,null,null,null,null,null,null,null,null,null,null,null,null,null,null,"○",null,null,"○",null,"○","○","○",null,"○"]
[null,null,null,"○","×","×","×","×","×","×","×","×","×","×","×","×","×","×","×","×","×","×","×","×","×","×","×","×","×","×","×","×","×","×","×","×","×","×","×","×","×","×","×","×","×","×","×","×","×","×","×","×","×","×","×","×","×","×","×","×","×","×","×","×","×","×","×","×","×","×","×","×","×","×","×","×","×","×","×","×","×","×","×","×","×","×","×","×","×","×","×","×","×","×","×","×","×","×","×","×",null,"×",null,"×",null,"×",null,"×",null,"×",null,"×",null,"×",null,"×",null,"×",null,"×",null,"×",null,"×",null,"×",null,"×",null,"×",null,"×",null,"×",null,"×","×","×","×","×","×","×","×","×","○","○","○","○","○","○","○","○","○","○","○","○","○","○","○","○","○","○","○","○","○","○","○","○","○","○","○","○","○","○","○","×","×","×","×","×","×","×","×","×","×","×","×","×","×","×","×","×","×","×","×","×","×","×","×","×","×","×","×","×","×","×","×","×","×","×","×","×","×","×","×","×","×","×","×","×","×","×","×","×","×","×","×","×","×","×","×","×","×","×","×","×","×","×","×","×","×","×","×","×","×","×","×","×","×","×","×","×","×","×","×","×","×","×","×","×","×","×","×","×","×","×","×","×","×","×","×","×","×","×","×","×","×","×","×","×","×","×","×","×","×","×","×","×","×","×","×","×","×","×","×","×","×","×","×","×","×","×","×","×","×","×","×","×","×","×","×","×","×","×","×","×","×","×","×","×","×","×","×","×","×","×","×","×","×","×","×","×","×","×","×","×","×","×","×","×","×","×","×","×","×","×","×","×","×","×","×","×","×","×","×","×","×","×","×","×","×","×","×","×","×","×","×","×","×","×","×","×","×","×","×","×","×","×","×","×","×","×","×","×","×","×","×","×","×","×","×","×","×","×","×","×","×","×","×","×","×","×","×","×","×","×","×","×","×","×","×","×","×","×","×","×","×","×","×","×","×","×","×","×","×","×","×","×","×","×","×","×","×","×","×","×","×","×","×","×","×","×","×","×","×","×","×","×","×","×","×","×","×","×","×","×","×","×","×","×","×","×","×","×","×","×","×","×","×","×","×","×","×","×","×","×","×","×","×","×","×","×","×","×","×","×","×","×","×","×","×","×","×","×","×","×","×","×","×","×","×","×","×","×","×","×","×","×","×","×","×","×","×","×","×","×","×","×","×","×","×","×","×","×","×","×","×","×","×","×","×","×","×","×","×","×","×","×","×","×","×","×","×","×","×","×","×","×","×","×","×","×","×","×","×","×","×","×","×","×","×","×","×","×","×","×","×","×","×","×","×","×","×","×","×","×","×","×","×","×","×","×","×","×","×","×","×","×","×","×","×",null,"△","△","△",null,null,null,null,"登録不可とする。","(*4)(*5)",null,null,1,"0001",0,0,0,1,null,null,null,null,null,null,null,null,null,null,null,null,null,null,null,null,null,null,null,null,null,null,null,null,null,null,null,null,null,null,null,"○",null,null,"○",null,"○","○","○",null,"○"]
[null,null,null,"○","×","×","×","×","×","×","×","×","×","×","×","×","×","×","×","×","×","×","×","×","×","×","×","×","×","×","×","×","×","×","×","×","×","×","×","×","×","×","×","×","×","×","×","×","×","×","×","×","×","×","×","×","×","×","×","×","×","×","×","×","×","×","×","×","×","×","×","×","×","×","×","×","×","×","×","×","×","×","×","×","×","×","×","×","×","×","×","×","×","×","×","×","×","×","×","×",null,"×",null,"×",null,"×",null,"×",null,"×",null,"×",null,"×",null,"×",null,"×",null,"×",null,"×",null,"×",null,"×",null,"×",null,"×",null,"×",null,"×",null,"×","×","×","×","×","×","×","×","×","○","○","○","○","○","○","○","○","○","○","○","○","○","○","○","○","○","○","○","○","○","○","○","○","○","○","○","○","○","○","○","×","×","×","×","×","×","×","×","×","×","×","×","×","×","×","×","×","×","×","×","×","×","×","×","×","×","×","×","×","×","×","×","×","×","×","×","×","×","×","×","×","×","×","×","×","×","×","×","×","×","×","×","×","×","×","×","×","×","×","×","×","×","×","×","×","×","×","×","×","×","×","×","×","×","×","×","×","×","×","×","×","×","×","×","×","×","×","×","×","×","×","×","×","×","×","×","×","×","×","×","×","×","×","×","×","×","×","×","×","×","×","×","×","×","×","×","×","×","×","×","×","×","×","×","×","×","×","×","×","×","×","×","×","×","×","×","×","×","×","×","×","×","×","×","×","×","×","×","×","×","×","×","×","×","×","×","×","×","×","×","×","×","×","×","×","×","×","×","×","×","×","×","×","×","×","×","×","×","×","×","×","×","×","×","×","×","×","×","×","×","×","×","×","×","×","×","×","×","×","×","×","×","×","×","×","×","×","×","×","×","×","×","×","×","×","×","×","×","×","×","×","×","×","×","×","×","×","×","×","×","×","×","×","×","×","×","×","×","×","×","×","×","×","×","×","×","×","×","×","×","×","×","×","×","×","×","×","×","×","×","×","×","×","×","×","×","×","×","×","×","×","×","×","×","×","×","×","×","×","×","×","×","×","×","×","×","×","×","×","×","×","×","×","×","×","×","×","×","×","×","×","×","×","×","×","×","×","×","×","×","×","×","×","×","×","×","×","×","×","×","×","×","×","×","×","×","×","×","×","×","×","×","×","×","×","×","×","×","×","×","×","×","×","×","×","×","×","×","×","×","×","×","×","×","×","×","×","×","×","×","×","×","×","×","×","×","×","×","×","×","×","×","×","×","×","×","×","×","×","×","×","×","×","×","×","×","×","×","×","×","×","×","×","×","×","×","×","×","×","×","×","×","×","×","×","×","×","×","×","×","×","×","×","×","×","×",null,"△","△","△",null,null,null,null,"送信拒否ドメインを設定する前に、登録した短縮登録については、チェックしない。","(*4)(*5)",null,null,1,"0001",0,0,0,1,null,null,null,null,null,null,null,null,null,null,null,null,null,null,null,null,null,null,null,null,null,null,null,null,null,null,null,null,null,null,null,"○",null,null,"○",null,"○","○","○",null,"○"]
[null,null,null,"○","×","×","×","×","×","×","×","×","×","×","×","×","×","×","×","×","×","×","×","×","×","×","×","×","×","×","×","×","×","×","×","×","×","×","×","×","×","×","×","×","×","×","×","×","×","×","×","×","×","×","×","×","×","×","×","×","×","×","×","×","×","×","×","×","×","×","×","×","×","×","×","×","×","×","×","×","×","×","×","×","×","×","×","×","×","×","×","×","×","×","×","×","×","×","×","×",null,"×",null,"×",null,"×",null,"×",null,"×",null,"×",null,"×",null,"×",null,"×",null,"×",null,"×",null,"×",null,"×",null,"×",null,"×",null,"×",null,"×",null,"×","×","×","×","×","×","×","×","×","○","○","○","○","○","○","○","○","○","○","○","○","○","○","○","○","○","○","○","○","○","○","○","○","○","○","○","○","○","○","○","×","×","×","×","×","×","×","×","×","×","×","×","×","×","×","×","×","×","×","×","×","×","×","×","×","×","×","×","×","×","×","×","×","×","×","×","×","×","×","×","×","×","×","×","×","×","×","×","×","×","×","×","×","×","×","×","×","×","×","×","×","×","×","×","×","×","×","×","×","×","×","×","×","×","×","×","×","×","×","×","×","×","×","×","×","×","×","×","×","×","×","×","×","×","×","×","×","×","×","×","×","×","×","×","×","×","×","×","×","×","×","×","×","×","×","×","×","×","×","×","×","×","×","×","×","×","×","×","×","×","×","×","×","×","×","×","×","×","×","×","×","×","×","×","×","×","×","×","×","×","×","×","×","×","×","×","×","×","×","×","×","×","×","×","×","×","×","×","×","×","×","×","×","×","×","×","×","×","×","×","×","×","×","×","×","×","×","×","×","×","×","×","×","×","×","×","×","×","×","×","×","×","×","×","×","×","×","×","×","×","×","×","×","×","×","×","×","×","×","×","×","×","×","×","×","×","×","×","×","×","×","×","×","×","×","×","×","×","×","×","×","×","×","×","×","×","×","×","×","×","×","×","×","×","×","×","×","×","×","×","×","×","×","×","×","×","×","×","×","×","×","×","×","×","×","×","×","×","×","×","×","×","×","×","×","×","×","×","×","×","×","×","×","×","×","×","×","×","×","×","×","×","×","×","×","×","×","×","×","×","×","×","×","×","×","×","×","×","×","×","×","×","×","×","×","×","×","×","×","×","×","×","×","×","×","×","×","×","×","×","×","×","×","×","×","×","×","×","×","×","×","×","×","×","×","×","×","×","×","×","×","×","×","×","×","×","×","×","×","×","×","×","×","×","×","×","×","×","×","×","×","×","×","×","×","×","×","×","×","×","×","×","×","×","×","×","×","×","×","×","×","×","×","×","×","×","×","×","×","×","×","×","×","×","×","×",null,"△","△","△",null,"※特Rom対応\n<MZV-29>\n指定したドメインのScan to Emailのみを許可する対応",null,null,null,"(*2)(*3)(*4)(*5)(*7)",null,null,1,"0001",0,0,0,1,null,null,null,null,null,null,null,null,null,null,null,null,null,null,null,null,null,null,null,null,null,null,null,null,null,null,null,null,null,null,null,"○",null,null,"○",null,"○","○","○",null,"○"]
[null,null,null,"○","×","×","×","×","×","×","×","×","×","×","×","×","×","×","×","×","×","×","×","×","×","×","×","×","×","×","×","×","×","×","×","×","×","×","×","×","×","×","×","×","×","×","×","×","×","×","×","×","×","×","×","×","×","×","×","×","×","×","×","×","×","×","×","×","×","×","×","×","×","×","×","×","×","×","×","×","×","×","×","×","×","×","×","×","×","×","×","×","×","×","×","×","×","×","×","×",null,"×",null,"×",null,"×",null,"×",null,"×",null,"×",null,"×",null,"×",null,"×",null,"×",null,"×",null,"×",null,"×",null,"×",null,"×",null,"×",null,"×",null,"×","×","×","×","×","×","×","×","×","○","○","○","○","○","○","○","○","○","○","○","○","○","○","○","○","○","○","○","○","○","○","○","○","○","○","○","○","○","○","○","×","×","×","×","×","×","×","×","×","×","×","×","×","×","×","×","×","×","×","×","×","×","×","×","×","×","×","×","×","×","×","×","×","×","×","×","×","×","×","×","×","×","×","×","×","×","×","×","×","×","×","×","×","×","×","×","×","×","×","×","×","×","×","×","×","×","×","×","×","×","×","×","×","×","×","×","×","×","×","×","×","×","×","×","×","×","×","×","×","×","×","×","×","×","×","×","×","×","×","×","×","×","×","×","×","×","×","×","×","×","×","×","×","×","×","×","×","×","×","×","×","×","×","×","×","×","×","×","×","×","×","×","×","×","×","×","×","×","×","×","×","×","×","×","×","×","×","×","×","×","×","×","×","×","×","×","×","×","×","×","×","×","×","×","×","×","×","×","×","×","×","×","×","×","×","×","×","×","×","×","×","×","×","×","×","×","×","×","×","×","×","×","×","×","×","×","×","×","×","×","×","×","×","×","×","×","×","×","×","×","×","×","×","×","×","×","×","×","×","×","×","×","×","×","×","×","×","×","×","×","×","×","×","×","×","×","×","×","×","×","×","×","×","×","×","×","×","×","×","×","×","×","×","×","×","×","×","×","×","×","×","×","×","×","×","×","×","×","×","×","×","×","×","×","×","×","×","×","×","×","×","×","×","×","×","×","×","×","×","×","×","×","×","×","×","×","×","×","×","×","×","×","×","×","×","×","×","×","×","×","×","×","×","×","×","×","×","×","×","×","×","×","×","×","×","×","×","×","×","×","×","×","×","×","×","×","×","×","×","×","×","×","×","×","×","×","×","×","×","×","×","×","×","×","×","×","×","×","×","×","×","×","×","×","×","×","×","×","×","×","×","×","×","×","×","×","×","×","×","×","×","×","×","×","×","×","×","×","×","×","×","×","×","×","×","×","×","×","×","×","×","×","×","×","×","×","×","×","×","×","×","×","×","×","×","×",null,"△","△","△",null,"DipSWNo.201 bit7(ON)が有効、かつDipSWNo.216 bit3(ON)が有効の場合、以下の動作とする。",null,null,null,"(*4)(*5)",null,null,1,"0001",0,0,0,1,null,null,null,null,null,null,null,null,null,null,null,null,null,null,null,null,null,null,null,null,null,null,null,null,null,null,null,null,null,null,null,"○",null,null,"○",null,"○","○","○",null,"○"]
[null,null,null,"○","×","×","×","×","×","×","×","×","×","×","×","×","×","×","×","×","×","×","×","×","×","×","×","×","×","×","×","×","×","×","×","×","×","×","×","×","×","×","×","×","×","×","×","×","×","×","×","×","×","×","×","×","×","×","×","×","×","×","×","×","×","×","×","×","×","×","×","×","×","×","×","×","×","×","×","×","×","×","×","×","×","×","×","×","×","×","×","×","×","×","×","×","×","×","×","×",null,"×",null,"×",null,"×",null,"×",null,"×",null,"×",null,"×",null,"×",null,"×",null,"×",null,"×",null,"×",null,"×",null,"×",null,"×",null,"×",null,"×",null,"×","×","×","×","×","×","×","×","×","○","○","○","○","○","○","○","○","○","○","○","○","○","○","○","○","○","○","○","○","○","○","○","○","○","○","○","○","○","○","○","×","×","×","×","×","×","×","×","×","×","×","×","×","×","×","×","×","×","×","×","×","×","×","×","×","×","×","×","×","×","×","×","×","×","×","×","×","×","×","×","×","×","×","×","×","×","×","×","×","×","×","×","×","×","×","×","×","×","×","×","×","×","×","×","×","×","×","×","×","×","×","×","×","×","×","×","×","×","×","×","×","×","×","×","×","×","×","×","×","×","×","×","×","×","×","×","×","×","×","×","×","×","×","×","×","×","×","×","×","×","×","×","×","×","×","×","×","×","×","×","×","×","×","×","×","×","×","×","×","×","×","×","×","×","×","×","×","×","×","×","×","×","×","×","×","×","×","×","×","×","×","×","×","×","×","×","×","×","×","×","×","×","×","×","×","×","×","×","×","×","×","×","×","×","×","×","×","×","×","×","×","×","×","×","×","×","×","×","×","×","×","×","×","×","×","×","×","×","×","×","×","×","×","×","×","×","×","×","×","×","×","×","×","×","×","×","×","×","×","×","×","×","×","×","×","×","×","×","×","×","×","×","×","×","×","×","×","×","×","×","×","×","×","×","×","×","×","×","×","×","×","×","×","×","×","×","×","×","×","×","×","×","×","×","×","×","×","×","×","×","×","×","×","×","×","×","×","×","×","×","×","×","×","×","×","×","×","×","×","×","×","×","×","×","×","×","×","×","×","×","×","×","×","×","×","×","×","×","×","×","×","×","×","×","×","×","×","×","×","×","×","×","×","×","×","×","×","×","×","×","×","×","×","×","×","×","×","×","×","×","×","×","×","×","×","×","×","×","×","×","×","×","×","×","×","×","×","×","×","×","×","×","×","×","×","×","×","×","×","×","×","×","×","×","×","×","×","×","×","×","×","×","×","×","×","×","×","×","×","×","×","×","×","×","×","×","×","×","×","×","×","×","×","×","×","×","×","×","×","×","×","×","×","×","×","×",null,"△","△","△",null,null,"メールアドレスに、送信許可ドメインに設定されているドメイン名が含まれない場合",null,null,"送信許可ドメインについては、\n「06_ユーティリティ（ネットワーク設定）.xlsx」 > [ネットワーク設定(IT5以降)] > ＜E-mail設定＞ > E-mail送信許可\nを参照\n(*4)(*5)",null,null,1,"0001",0,0,0,1,null,null,null,null,null,null,null,null,null,null,null,null,null,null,null,null,null,null,null,null,null,null,null,null,null,null,null,null,null,null,null,"○",null,null,"○",null,"○","○","○",null,"○"]
[null,null,null,"○","×","×","×","×","×","×","×","×","×","×","×","×","×","×","×","×","×","×","×","×","×","×","×","×","×","×","×","×","×","×","×","×","×","×","×","×","×","×","×","×","×","×","×","×","×","×","×","×","×","×","×","×","×","×","×","×","×","×","×","×","×","×","×","×","×","×","×","×","×","×","×","×","×","×","×","×","×","×","×","×","×","×","×","×","×","×","×","×","×","×","×","×","×","×","×","×",null,"×",null,"×",null,"×",null,"×",null,"×",null,"×",null,"×",null,"×",null,"×",null,"×",null,"×",null,"×",null,"×",null,"×",null,"×",null,"×",null,"×",null,"×","×","×","×","×","×","×","×","×","○","○","○","○","○","○","○","○","○","○","○","○","○","○","○","○","○","○","○","○","○","○","○","○","○","○","○","○","○","○","○","×","×","×","×","×","×","×","×","×","×","×","×","×","×","×","×","×","×","×","×","×","×","×","×","×","×","×","×","×","×","×","×","×","×","×","×","×","×","×","×","×","×","×","×","×","×","×","×","×","×","×","×","×","×","×","×","×","×","×","×","×","×","×","×","×","×","×","×","×","×","×","×","×","×","×","×","×","×","×","×","×","×","×","×","×","×","×","×","×","×","×","×","×","×","×","×","×","×","×","×","×","×","×","×","×","×","×","×","×","×","×","×","×","×","×","×","×","×","×","×","×","×","×","×","×","×","×","×","×","×","×","×","×","×","×","×","×","×","×","×","×","×","×","×","×","×","×","×","×","×","×","×","×","×","×","×","×","×","×","×","×","×","×","×","×","×","×","×","×","×","×","×","×","×","×","×","×","×","×","×","×","×","×","×","×","×","×","×","×","×","×","×","×","×","×","×","×","×","×","×","×","×","×","×","×","×","×","×","×","×","×","×","×","×","×","×","×","×","×","×","×","×","×","×","×","×","×","×","×","×","×","×","×","×","×","×","×","×","×","×","×","×","×","×","×","×","×","×","×","×","×","×","×","×","×","×","×","×","×","×","×","×","×","×","×","×","×","×","×","×","×","×","×","×","×","×","×","×","×","×","×","×","×","×","×","×","×","×","×","×","×","×","×","×","×","×","×","×","×","×","×","×","×","×","×","×","×","×","×","×","×","×","×","×","×","×","×","×","×","×","×","×","×","×","×","×","×","×","×","×","×","×","×","×","×","×","×","×","×","×","×","×","×","×","×","×","×","×","×","×","×","×","×","×","×","×","×","×","×","×","×","×","×","×","×","×","×","×","×","×","×","×","×","×","×","×","×","×","×","×","×","×","×","×","×","×","×","×","×","×","×","×","×","×","×","×","×","×","×","×","×","×","×","×","×","×","×","×","×","×","×","×","×","×","×","×",null,"△","△","△",null,null,null,"パネルから手動宛先入力時",null,"(*4)(*5)",null,null,1,"0001",0,0,0,1,null,null,null,null,null,null,null,null,null,null,null,null,null,null,null,null,null,null,null,null,null,null,null,null,null,null,null,null,null,null,null,"○",null,null,"○",null,"○","○","○",null,"○"]
[null,null,null,"○","×","×","×","×","×","×","×","×","×","×","×","×","×","×","×","×","×","×","×","×","×","×","×","×","×","×","×","×","×","×","×","×","×","×","×","×","×","×","×","×","×","×","×","×","×","×","×","×","×","×","×","×","×","×","×","×","×","×","×","×","×","×","×","×","×","×","×","×","×","×","×","×","×","×","×","×","×","×","×","×","×","×","×","×","×","×","×","×","×","×","×","×","×","×","×","×",null,"×",null,"×",null,"×",null,"×",null,"×",null,"×",null,"×",null,"×",null,"×",null,"×",null,"×",null,"×",null,"×",null,"×",null,"×",null,"×",null,"×",null,"×","×","×","×","×","×","×","×","×","○","○","○","○","○","○","○","○","○","○","○","○","○","○","○","○","○","○","○","○","○","○","○","○","○","○","○","○","○","○","○","×","×","×","×","×","×","×","×","×","×","×","×","×","×","×","×","×","×","×","×","×","×","×","×","×","×","×","×","×","×","×","×","×","×","×","×","×","×","×","×","×","×","×","×","×","×","×","×","×","×","×","×","×","×","×","×","×","×","×","×","×","×","×","×","×","×","×","×","×","×","×","×","×","×","×","×","×","×","×","×","×","×","×","×","×","×","×","×","×","×","×","×","×","×","×","×","×","×","×","×","×","×","×","×","×","×","×","×","×","×","×","×","×","×","×","×","×","×","×","×","×","×","×","×","×","×","×","×","×","×","×","×","×","×","×","×","×","×","×","×","×","×","×","×","×","×","×","×","×","×","×","×","×","×","×","×","×","×","×","×","×","×","×","×","×","×","×","×","×","×","×","×","×","×","×","×","×","×","×","×","×","×","×","×","×","×","×","×","×","×","×","×","×","×","×","×","×","×","×","×","×","×","×","×","×","×","×","×","×","×","×","×","×","×","×","×","×","×","×","×","×","×","×","×","×","×","×","×","×","×","×","×","×","×","×","×","×","×","×","×","×","×","×","×","×","×","×","×","×","×","×","×","×","×","×","×","×","×","×","×","×","×","×","×","×","×","×","×","×","×","×","×","×","×","×","×","×","×","×","×","×","×","×","×","×","×","×","×","×","×","×","×","×","×","×","×","×","×","×","×","×","×","×","×","×","×","×","×","×","×","×","×","×","×","×","×","×","×","×","×","×","×","×","×","×","×","×","×","×","×","×","×","×","×","×","×","×","×","×","×","×","×","×","×","×","×","×","×","×","×","×","×","×","×","×","×","×","×","×","×","×","×","×","×","×","×","×","×","×","×","×","×","×","×","×","×","×","×","×","×","×","×","×","×","×","×","×","×","×","×","×","×","×","×","×","×","×","×","×","×","×","×","×","×","×","×","×","×","×","×","×","×","×","×","×","×",null,"△","△","△",null,null,null,null,"送信不可とする。","(*4)(*5)",null,null,1,"0001",0,0,0,1,null,null,null,null,null,null,null,null,null,null,null,null,null,null,null,null,null,null,null,null,null,null,null,null,null,null,null,null,null,null,null,"○",null,null,"○",null,"○","○","○",null,"○"]
[null,null,null,"○","×","×","×","×","×","×","×","×","×","×","×","×","×","×","×","×","×","×","×","×","×","×","×","×","×","×","×","×","×","×","×","×","×","×","×","×","×","×","×","×","×","×","×","×","×","×","×","×","×","×","×","×","×","×","×","×","×","×","×","×","×","×","×","×","×","×","×","×","×","×","×","×","×","×","×","×","×","×","×","×","×","×","×","×","×","×","×","×","×","×","×","×","×","×","×","×",null,"×",null,"×",null,"×",null,"×",null,"×",null,"×",null,"×",null,"×",null,"×",null,"×",null,"×",null,"×",null,"×",null,"×",null,"×",null,"×",null,"×",null,"×","×","×","×","×","×","×","×","×","○","○","○","○","○","○","○","○","○","○","○","○","○","○","○","○","○","○","○","○","○","○","○","○","○","○","○","○","○","○","○","×","×","×","×","×","×","×","×","×","×","×","×","×","×","×","×","×","×","×","×","×","×","×","×","×","×","×","×","×","×","×","×","×","×","×","×","×","×","×","×","×","×","×","×","×","×","×","×","×","×","×","×","×","×","×","×","×","×","×","×","×","×","×","×","×","×","×","×","×","×","×","×","×","×","×","×","×","×","×","×","×","×","×","×","×","×","×","×","×","×","×","×","×","×","×","×","×","×","×","×","×","×","×","×","×","×","×","×","×","×","×","×","×","×","×","×","×","×","×","×","×","×","×","×","×","×","×","×","×","×","×","×","×","×","×","×","×","×","×","×","×","×","×","×","×","×","×","×","×","×","×","×","×","×","×","×","×","×","×","×","×","×","×","×","×","×","×","×","×","×","×","×","×","×","×","×","×","×","×","×","×","×","×","×","×","×","×","×","×","×","×","×","×","×","×","×","×","×","×","×","×","×","×","×","×","×","×","×","×","×","×","×","×","×","×","×","×","×","×","×","×","×","×","×","×","×","×","×","×","×","×","×","×","×","×","×","×","×","×","×","×","×","×","×","×","×","×","×","×","×","×","×","×","×","×","×","×","×","×","×","×","×","×","×","×","×","×","×","×","×","×","×","×","×","×","×","×","×","×","×","×","×","×","×","×","×","×","×","×","×","×","×","×","×","×","×","×","×","×","×","×","×","×","×","×","×","×","×","×","×","×","×","×","×","×","×","×","×","×","×","×","×","×","×","×","×","×","×","×","×","×","×","×","×","×","×","×","×","×","×","×","×","×","×","×","×","×","×","×","×","×","×","×","×","×","×","×","×","×","×","×","×","×","×","×","×","×","×","×","×","×","×","×","×","×","×","×","×","×","×","×","×","×","×","×","×","×","×","×","×","×","×","×","×","×","×","×","×","×","×","×","×","×","×","×","×","×","×","×","×","×","×","×","×","×","×",null,"△","△","△",null,null,null,"パネルから短縮宛先登録時",null,"(*4)(*5)",null,null,1,"0001",0,0,0,1,null,null,null,null,null,null,null,null,null,null,null,null,null,null,null,null,null,null,null,null,null,null,null,null,null,null,null,null,null,null,null,"○",null,null,"○",null,"○","○","○",null,"○"]
[null,null,null,"○","×","×","×","×","×","×","×","×","×","×","×","×","×","×","×","×","×","×","×","×","×","×","×","×","×","×","×","×","×","×","×","×","×","×","×","×","×","×","×","×","×","×","×","×","×","×","×","×","×","×","×","×","×","×","×","×","×","×","×","×","×","×","×","×","×","×","×","×","×","×","×","×","×","×","×","×","×","×","×","×","×","×","×","×","×","×","×","×","×","×","×","×","×","×","×","×",null,"×",null,"×",null,"×",null,"×",null,"×",null,"×",null,"×",null,"×",null,"×",null,"×",null,"×",null,"×",null,"×",null,"×",null,"×",null,"×",null,"×",null,"×","×","×","×","×","×","×","×","×","○","○","○","○","○","○","○","○","○","○","○","○","○","○","○","○","○","○","○","○","○","○","○","○","○","○","○","○","○","○","○","×","×","×","×","×","×","×","×","×","×","×","×","×","×","×","×","×","×","×","×","×","×","×","×","×","×","×","×","×","×","×","×","×","×","×","×","×","×","×","×","×","×","×","×","×","×","×","×","×","×","×","×","×","×","×","×","×","×","×","×","×","×","×","×","×","×","×","×","×","×","×","×","×","×","×","×","×","×","×","×","×","×","×","×","×","×","×","×","×","×","×","×","×","×","×","×","×","×","×","×","×","×","×","×","×","×","×","×","×","×","×","×","×","×","×","×","×","×","×","×","×","×","×","×","×","×","×","×","×","×","×","×","×","×","×","×","×","×","×","×","×","×","×","×","×","×","×","×","×","×","×","×","×","×","×","×","×","×","×","×","×","×","×","×","×","×","×","×","×","×","×","×","×","×","×","×","×","×","×","×","×","×","×","×","×","×","×","×","×","×","×","×","×","×","×","×","×","×","×","×","×","×","×","×","×","×","×","×","×","×","×","×","×","×","×","×","×","×","×","×","×","×","×","×","×","×","×","×","×","×","×","×","×","×","×","×","×","×","×","×","×","×","×","×","×","×","×","×","×","×","×","×","×","×","×","×","×","×","×","×","×","×","×","×","×","×","×","×","×","×","×","×","×","×","×","×","×","×","×","×","×","×","×","×","×","×","×","×","×","×","×","×","×","×","×","×","×","×","×","×","×","×","×","×","×","×","×","×","×","×","×","×","×","×","×","×","×","×","×","×","×","×","×","×","×","×","×","×","×","×","×","×","×","×","×","×","×","×","×","×","×","×","×","×","×","×","×","×","×","×","×","×","×","×","×","×","×","×","×","×","×","×","×","×","×","×","×","×","×","×","×","×","×","×","×","×","×","×","×","×","×","×","×","×","×","×","×","×","×","×","×","×","×","×","×","×","×","×","×","×","×","×","×","×","×","×","×","×","×","×","×","×","×","×","×","×",null,"△","△","△",null,null,null,null,"登録不可とする。","(*4)(*5)",null,null,1,"0001",0,0,0,1,null,null,null,null,null,null,null,null,null,null,null,null,null,null,null,null,null,null,null,null,null,null,null,null,null,null,null,null,null,null,null,"○",null,null,"○",null,"○","○","○",null,"○"]
[null,null,null,"○","×","×","×","×","×","×","×","×","×","×","×","×","×","×","×","×","×","×","×","×","×","×","×","×","×","×","×","×","×","×","×","×","×","×","×","×","×","×","×","×","×","×","×","×","×","×","×","×","×","×","×","×","×","×","×","×","×","×","×","×","×","×","×","×","×","×","×","×","×","×","×","×","×","×","×","×","×","×","×","×","×","×","×","×","×","×","×","×","×","×","×","×","×","×","×","×",null,"×",null,"×",null,"×",null,"×",null,"×",null,"×",null,"×",null,"×",null,"×",null,"×",null,"×",null,"×",null,"×",null,"×",null,"×",null,"×",null,"×",null,"×","×","×","×","×","×","×","×","×","○","○","○","○","○","○","○","○","○","○","○","○","○","○","○","○","○","○","○","○","○","○","○","○","○","○","○","○","○","○","○","×","×","×","×","×","×","×","×","×","×","×","×","×","×","×","×","×","×","×","×","×","×","×","×","×","×","×","×","×","×","×","×","×","×","×","×","×","×","×","×","×","×","×","×","×","×","×","×","×","×","×","×","×","×","×","×","×","×","×","×","×","×","×","×","×","×","×","×","×","×","×","×","×","×","×","×","×","×","×","×","×","×","×","×","×","×","×","×","×","×","×","×","×","×","×","×","×","×","×","×","×","×","×","×","×","×","×","×","×","×","×","×","×","×","×","×","×","×","×","×","×","×","×","×","×","×","×","×","×","×","×","×","×","×","×","×","×","×","×","×","×","×","×","×","×","×","×","×","×","×","×","×","×","×","×","×","×","×","×","×","×","×","×","×","×","×","×","×","×","×","×","×","×","×","×","×","×","×","×","×","×","×","×","×","×","×","×","×","×","×","×","×","×","×","×","×","×","×","×","×","×","×","×","×","×","×","×","×","×","×","×","×","×","×","×","×","×","×","×","×","×","×","×","×","×","×","×","×","×","×","×","×","×","×","×","×","×","×","×","×","×","×","×","×","×","×","×","×","×","×","×","×","×","×","×","×","×","×","×","×","×","×","×","×","×","×","×","×","×","×","×","×","×","×","×","×","×","×","×","×","×","×","×","×","×","×","×","×","×","×","×","×","×","×","×","×","×","×","×","×","×","×","×","×","×","×","×","×","×","×","×","×","×","×","×","×","×","×","×","×","×","×","×","×","×","×","×","×","×","×","×","×","×","×","×","×","×","×","×","×","×","×","×","×","×","×","×","×","×","×","×","×","×","×","×","×","×","×","×","×","×","×","×","×","×","×","×","×","×","×","×","×","×","×","×","×","×","×","×","×","×","×","×","×","×","×","×","×","×","×","×","×","×","×","×","×","×","×","×","×","×","×","×","×","×","×","×","×","×","×","×","×","×","×","×","×",null,"△","△","△",null,null,null,null,"送信許可ドメインを設定する前に、登録した短縮登録については、チェックしない。","(*4)(*5)",null,null,1,"0001",0,0,0,1,null,null,null,null,null,null,null,null,null,null,null,null,null,null,null,null,null,null,null,null,null,null,null,null,null,null,null,null,null,null,null,"○",null,null,"○",null,"○","○","○",null,"○"]
[null,null,null,"○","×","×","×","×","×","×","×","×","×","×","×","×","×","×","×","×","×","×","×","×","×","×","×","×","×","×","×","×","×","×","×","×","×","×","×","×","×","×","×","×","×","×","×","×","×","×","×","×","×","×","×","×","×","×","×","×","×","×","×","×","×","×","×","×","×","×","×","×","×","×","×","×","×","×","×","×","×","×","×","×","×","×","×","×","×","×","×","×","×","×","×","×","×","×","×","×",null,"×",null,"×",null,"×",null,"×",null,"×",null,"×",null,"×",null,"×",null,"×",null,"×",null,"×",null,"×",null,"×",null,"×",null,"×",null,"×",null,"×",null,"×","×","×","×","×","×","×","×","×","×","×","×","×","×","×","×","×","×","×","×","×","×","×","×","×","×","×","×","×","×","×","×","×","×","×","×","×","×","×","×","○","○","○","○","○","○","○","○","○","○","○","○","○","○","○","○","○","○","○","○","○","○","○","○","○","○","○","○","○","○","○","○","○","○","○","○","○","○","○","○","○","○","○","○","○","○","○","○","○","○","○","○","○","○","○","○","○","○","○","○","○","○","○","○","○","○","○","○","○","○","○","○","○","○","○","○","○","○","○","○","○","○","○","○","○","○","○","○","○","○","○","○","○","○","○","○","○","○","○","○","○","○","○","○","○","○","○","○","○","○","○","○","○","○","○","○","○","○","○","○","○","○","○","○","○","○","○","○","○","○","○","○","×","○","○","○","○","○","○","○","○","○","○","×","○","○","○","○","○","○","○","○","○","○","○","○","○","○","○","○","×","○","○","○","○","○","○","○","○","○","○","○","○","○","○","×","○","○","○","○","○","○","○","○","○","○","○","○","○","×","○","○","○","○","○","○","○","○","○","○","○","○","○","○","○","○","×","○","○","○","○","○","○","○","○","○","○","○","○","○","○","×","○","○","○","○","○","○","○","○","○","○","○","○","○","○","○","○","×","○","○","○","○","○","○","○","○","○","○","○","○","○","○","×","○","○","○","○","○","○","○","○","○","○","○","○","○","○","○","○","×","○","○","○","○","○","○","○","○","○","○","○","○","○","○","○","○","×","○","○","○","○","○","○","○","○","○","○","○","○","○","○","○","○","×","○","○","○","○","○","○","○","○","○","○","○","○","○","○","×","○","○","○","○","○","○","○","○","○","○","○","○","○","○","○","○","×","○","○","○","○","○","○","○","○","○","○","○","○","○","○","○","○","○","×","○","○","○","○","○","×","○","○","○","○","○","○","×","○","○","○","○","○","○","○","○","○","○","○","○","○","○","○","○","×","○","○","○","○","○","○","○","○","○","○","○","○","○","○","○","○","○","○","○","○","×","○","○","○","○","○","○","○","○","×","○",null,"A",null,null,null,"送信ドメイン制限設定(*6)(*7)",null,null,null,"(*3)(*8)",null,null,1,"0001",0,0,0,1,null,null,null,null,null,null,null,null,null,null,null,null,null,null,null,null,null,null,null,null,null,null,null,null,null,null,null,null,null,null,null,null,null,null,"○","○",null,"○","○",null,"○"]
[null,null,null,"○","×","×","×","×","×","×","×","×","×","×","×","×","×","×","×","×","×","×","×","×","×","×","×","×","×","×","×","×","×","×","×","×","×","×","×","×","×","×","×","×","×","×","×","×","×","×","×","×","×","×","×","×","×","×","×","×","×","×","×","×","×","×","×","×","×","×","×","×","×","×","×","×","×","×","×","×","×","×","×","×","×","×","×","×","×","×","×","×","×","×","×","×","×","×","×","×",null,"×",null,"×",null,"×",null,"×",null,"×",null,"×",null,"×",null,"×",null,"×",null,"×",null,"×",null,"×",null,"×",null,"×",null,"×",null,"×",null,"×",null,"×","×","×","×","×","×","×","×","×","×","×","×","×","×","×","×","×","×","×","×","×","×","×","×","×","×","×","×","×","×","×","×","×","×","×","×","×","×","×","×","○","○","○","○","○","○","○","○","○","○","○","○","○","○","○","○","○","○","○","○","○","○","○","○","○","○","○","○","○","○","○","○","○","○","○","○","○","○","○","○","○","○","○","○","○","○","○","○","○","○","○","○","○","○","○","○","○","○","○","○","○","○","○","○","○","○","○","○","○","○","○","○","○","○","○","○","○","○","○","○","○","○","○","○","○","○","○","○","○","○","○","○","○","○","○","○","○","○","○","○","○","○","○","○","○","○","○","○","○","○","○","○","○","○","○","○","○","○","○","○","○","○","○","○","○","○","○","○","○","○","○","○","×","○","○","○","○","○","○","○","○","○","○","×","○","○","○","○","○","○","○","○","○","○","○","○","○","○","○","○","×","○","○","○","○","○","○","○","○","○","○","○","○","○","○","×","○","○","○","○","○","○","○","○","○","○","○","○","○","×","○","○","○","○","○","○","○","○","○","○","○","○","○","○","○","○","×","○","○","○","○","○","○","○","○","○","○","○","○","○","○","×","○","○","○","○","○","○","○","○","○","○","○","○","○","○","○","○","×","○","○","○","○","○","○","○","○","○","○","○","○","○","○","×","○","○","○","○","○","○","○","○","○","○","○","○","○","○","○","○","×","○","○","○","○","○","○","○","○","○","○","○","○","○","○","○","○","×","○","○","○","○","○","○","○","○","○","○","○","○","○","○","○","○","×","○","○","○","○","○","○","○","○","○","○","○","○","○","○","×","○","○","○","○","○","○","○","○","○","○","○","○","○","○","○","○","×","○","○","○","○","○","○","○","○","○","○","○","○","○","○","○","○","○","×","○","○","○","○","○","×","○","○","○","○","○","○","×","○","○","○","○","○","○","○","○","○","○","○","○","○","○","○","○","×","○","○","○","○","○","○","○","○","○","○","○","○","○","○","○","○","○","○","○","○","×","○","○","○","○","○","○","○","○","×","○",null,"A",null,null,null,null,"許可するドメインへのみ送信を可能とする、\n又は拒否するドメインへ送信しないことを可能とする",null,null,null,null,null,1,"0001",0,0,0,1,null,null,null,null,null,null,null,null,null,null,null,null,null,null,null,null,null,null,null,null,null,null,null,null,null,null,null,null,null,null,null,null,null,null,"○","○",null,null,"○",null,"○"]

{"sheet":"PSPパラメータ対応表","index":2,"n_rows":1006,"n_cols":17,"rows_kept":1006,"cut":false,"hidden":false,"merged":[]}
[null,null,null,null,null,null,"SP","F","BIN",4,3,2,1]
[null,"PSPがMFPに対し指定する読込み設定を下記に示す。",null,null,null,null,null,1,{"$f":"IF(H2=\"\",\"\",DEC2BIN(H2,4))","v":"0001"},{"$f":"IF($I2=\"\",\"\",VALUE(MID($I2,1,1)))","v":0},{"$f":"IF($I2=\"\",\"\",VALUE(MID($I2,2,1)))","v":0},{"$f":"IF($I2=\"\",\"\",VALUE(MID($I2,3,1)))","v":0},{"$f":"IF($I2=\"\",\"\",VALUE(MID($I2,4,1)))","v":1}]
[null,"(※該当する設定値をMFPが持たない場合は初期値を用いる。)",null,null,null,null,null,1,{"$f":"IF(H3=\"\",\"\",DEC2BIN(H3,4))","v":"0001"},{"$f":"IF($I3=\"\",\"\",VALUE(MID($I3,1,1)))","v":0},{"$f":"IF($I3=\"\",\"\",VALUE(MID($I3,2,1)))","v":0},{"$f":"IF($I3=\"\",\"\",VALUE(MID($I3,3,1)))","v":0},{"$f":"IF($I3=\"\",\"\",VALUE(MID($I3,4,1)))","v":1}]
[null,null,null,null,null,null,null,null,{"$f":"IF(H4=\"\",\"\",DEC2BIN(H4,4))","v":""},{"$f":"IF($I4=\"\",\"\",VALUE(MID($I4,1,1)))","v":""},{"$f":"IF($I4=\"\",\"\",VALUE(MID($I4,2,1)))","v":""},{"$f":"IF($I4=\"\",\"\",VALUE(MID($I4,3,1)))","v":""},{"$f":"IF($I4=\"\",\"\",VALUE(MID($I4,4,1)))","v":""}]
[null,null,"カラーモード",null,null,null,null,1,"0001",0,0,0,1]
[null,null,"PSPの設定値","MFPの設定値",null,null,null,1,"0001",0,0,0,1]
[null,null,"BlackAndWhite1","白黒２値",null,null,null,1,"0001",0,0,0,1,null,null,"BlackAndWhite1"]
[null,null,"Grayscale4","-",null,null,null,1,"0001",0,0,0,1,null,null,"Grayscale4"]
[null,null,"Grayscale8","グレースケール",null,null,null,1,"0001",0,0,0,1,null,null,"Grayscale8"]
[null,null,"Grayscale16","-",null,null,null,1,"0001",0,0,0,1,null,null,"Grayscale16"]
[null,null,"RGB24","フルカラー",null,null,null,1,"0001",0,0,0,1,null,null,"RGB24"]
[null,null,"RGB48","-",null,null,null,1,"0001",0,0,0,1,null,null,"RGB48"]
[null,null,"RGBa32","-",null,null,null,1,"0001",0,0,0,1,null,null,"RGBa32"]
[null,null,"RGBa64","-",null,null,null,1,"0001",0,0,0,1,null,null,"RGBa64"]
[null,null,null,null,null,null,null,null,"","","","",""]
[null,null,"画像フォーマット",null,null,null,null,1,"0001",0,0,0,1]
[null,null,"PSPの設定値","MFPの設定値",null,null,null,1,"0001",0,0,0,1]
[null,null,"dib","-",null,null,null,1,"0001",0,0,0,1,null,null,"dib"]
[null,null,"exif","-",null,null,null,1,"0001",0,0,0,1,null,null,"exif"]
[null,null,"jbig","-",null,null,null,1,"0001",0,0,0,1,null,null,"jbig"]
[null,null,"jfif","JPEG",null,null,null,1,"0001",0,0,0,1,null,null,"jfif"]
[null,null,"jpeg2k","-",null,null,null,1,"0001",0,0,0,1,null,null,"jpeg2k"]
[null,null,"pdf-a","PDF","*PSPの設定値はpdf-aだが、MFPから送信するファイルはPDFであればOK。コンパクトPDF、サーチャブルPDFなどもOKとする。",null,null,1,"0001",0,0,0,1,null,null,"pdf-a"]
[null,null,"png","-",null,null,null,1,"0001",0,0,0,1,null,null,"png"]
[null,null,"tiff-(single/multi)-uncompressed","Tiff　uncompressed (一枚毎/一括)",null,null,null,1,"0001",0,0,0,1,null,null,"tiff-(single/multi)-uncompressed"]
[null,null,"tiff-(single/multi)-g4","Tiff　白黒２値圧縮方法・ＭＭＲ (一枚毎/一括)",null,null,null,1,"0001",0,0,0,1,null,null,"tiff-(single/multi)-g4"]
[null,null,"tiff-(single/multi)-g3mh","Tiff　白黒２値圧縮方法・ＭＨ (一枚毎/一括)",null,null,null,1,"0001",0,0,0,1,null,null,"tiff-(single/multi)-g3mh"]
[null,null,"tiff-(single/multi)-jpeg-tn2","ColorTiff (一枚毎/一括)",null,null,null,1,"0001",0,0,0,1,null,null,"tiff-(single/multi)-jpeg-tn2"]
[null,null,"xps","XPS","*MFPから送信するファイルはXPSであればOK。コンパクトXPSでも良い",null,null,1,"0001",0,0,0,1,null,null,"xps","XPS"]
[null,null,null,null,null,null,null,null,"","","","",""]
[null,null,"解像度",null,null,null,null,1,"0001",0,0,0,1]
[null,null,"PSPの設定値","MFPの設定値",null,null,null,1,"0001",0,0,0,1]
[null,null,"整数で自由に設定される","200×200dpi",null,null,null,1,"0001",0,0,0,1,null,null,null,"200×200dpi"]
[null,null,null,"300×300dpi",null,null,null,1,"0001",0,0,0,1,null,null,null,"300×300dpi"]
[null,null,null,"400×400dpi",null,null,null,1,"0001",0,0,0,1,null,null,null,"400×400dpi"]
[null,null,null,"600×600dpi",null,null,null,1,"0001",0,0,0,1,null,null,null,"600×600dpi"]
[null,null,null,null,null,null,null,null,"","","","",""]
[null,null,null,null,null,null,null,null,"","","","",""]
[null,null,"【履　　歴】","2009/1/29　新規作成　姉崎",null,null,null,1,"0001",0,0,0,1]
[null,null,null,"2011/6/20　改訂　河邉","統合仕様書に反映",null,null,1,"0001",0,0,0,1]
[null,null,null,null,null,null,"e","e","e","e","e","e","e"]
[]
[]
[null,null,null,null,null,null,null,null,{"$f":"SUM(M2:M40)","v":34}]
[]
[]
[]
[]
[]
[]
[]
[]
[]
[]
[]
[]
[]
[]
[]
[]
[]
[]
[]
[]
[]
[]
[]
[]
[]
[]
[]
[]
[]
[]
[]
[]
[]
[]
[]
[]
[]
[]
[]
[]
[]
[]
[]
[]
[]
[]
[]
[]
[]
[]
[]
[]
[]
[]
[]
[]
[]
[]
[]
[]
[]
[]
[]
[]
[]
[]
[]
[]
[]
[]
[]
[]
[]
[]
[]
[]
[]
[]
[]
[]
[]
[]
[]
[]
[]
[]
[]
[]
[]
[]
[]
[]
[]
[]
[]
[]
[]
[]
[]
[]
[]
[]
[]
[]
[]
[]
[]
[]
[]
[]
[]
[]
[]
[]
[]
[]
[]
[]
[]
[]
[]
[]
[]
[]
[]
[]
[]
[]
[]
[]
[]
[]
[]
[]
[]
[]
[]
[]
[]
[]
[]
[]
[]
[]
[]
[]
[]
[]
[]
[]
[]
[]
[]
[]
[]
[]
[]
[]
[]
[]
[]
[]
[]
[]
[]
[]
[]
[]
[]
[]
[]
[]
[]
[]
[]
[]
[]
[]
[]
[]
[]
[]
[]
[]
[]
[]
[]
[]
[]
[]
[]
[]
[]
[]
[]
[]
[]
[]
[]
[]
[]
[]
[]
[]
[]
[]
[]
[]
[]
[]
[]
[]
[]
[]
[]
[]
[]
[]
[]
[]
[]
[]
[]
[]
[]
[]
[]
[]
[]
[]
[]
[]
[]
[]
[]
[]
[]
[]
[]
[]
[]
[]
[]
[]
[]
[]
[]
[]
[]
[]
[]
[]
[]
[]
[]
[]
[]
[]
[]
[]
[]
[]
[]
[]
[]
[]
[]
[]
[]
[]
[]
[]
[]
[]
[]
[]
[]
[]
[]
[]
[]
[]
[]
[]
[]
[]
[]
[]
[]
[]
[]
[]
[]
[]
[]
[]
[]
[]
[]
[]
[]
[]
[]
[]
[]
[]
[]
[]
[]
[]
[]
[]
[]
[]
[]
[]
[]
[]
[]
[]
[]
[]
[]
[]
[]
[]
[]
[]
[]
[]
[]
[]
[]
[]
[]
[]
[]
[]
[]
[]
[]
[]
[]
[]
[]
[]
[]
[]
[]
[]
[]
[]
[]
[]
[]
[]
[]
[]
[]
[]
[]
[]
[]
[]
[]
[]
[]
[]
[]
[]
[]
[]
[]
[]
[]
[]
[]
[]
[]
[]
[]
[]
[]
[]
[]
[]
[]
[]
[]
[]
[]
[]
[]
[]
[]
[]
[]
[]
[]
[]
[]
[]
[]
[]
[]
[]
[]
[]
[]
[]
[]
[]
[]
[]
[]
[]
[]
[]
[]
[]
[]
[]
[]
[]
[]
[]
[]
[]
[]
[]
[]
[]
[]
[]
[]
[]
[]
[]
[]
[]
[]
[]
[]
[]
[]
[]
[]
[]
[]
[]
[]
[]
[]
[]
[]
[]
[]
[]
[]
[]
[]
[]
[]
[]
[]
[]
[]
[]
[]
[]
[]
[]
[]
[]
[]
[]
[]
[]
[]
[]
[]
[]
[]
[]
[]
[]
[]
[]
[]
[]
[]
[]
[]
[]
[]
[]
[]
[]
[]
[]
[]
[]
[]
[]
[]
[]
[]
[]
[]
[]
[]
[]
[]
[]
[]
[]
[]
[]
[]
[]
[]
[]
[]
[]
[]
[]
[]
[]
[]
[]
[]
[]
[]
[]
[]
[]
[]
[]
[]
[]
[]
[]
[]
[]
[]
[]
[]
[]
[]
[]
[]
[]
[]
[]
[]
[]
[]
[]
[]
[]
[]
[]
[]
[]
[]
[]
[]
[]
[]
[]
[]
[]
[]
[]
[]
[]
[]
[]
[]
[]
[]
[]
[]
[]
[]
[]
[]
[]
[]
[]
[]
[]
[]
[]
[]
[]
[]
[]
[]
[]
[]
[]
[]
[]
[]
[]
[]
[]
[]
[]
[]
[]
[]
[]
[]
[]
[]
[]
[]
[]
[]
[]
[]
[]
[]
[]
[]
[]
[]
[]
[]
[]
[]
[]
[]
[]
[]
[]
[]
[]
[]
[]
[]
[]
[]
[]
[]
[]
[]
[]
[]
[]
[]
[]
[]
[]
[]
[]
[]
[]
[]
[]
[]
[]
[]
[]
[]
[]
[]
[]
[]
[]
[]
[]
[]
[]
[]
[]
[]
[]
[]
[]
[]
[]
[]
[]
[]
[]
[]
[]
[]
[]
[]
[]
[]
[]
[]
[]
[]
[]
[]
[]
[]
[]
[]
[]
[]
[]
[]
[]
[]
[]
[]
[]
[]
[]
[]
[]
[]
[]
[]
[]
[]
[]
[]
[]
[]
[]
[]
[]
[]
[]
[]
[]
[]
[]
[]
[]
[]
[]
[]
[]
[]
[]
[]
[]
[]
[]
[]
[]
[]
[]
[]
[]
[]
[]
[]
[]
[]
[]
[]
[]
[]
[]
[]
[]
[]
[]
[]
[]
[]
[]
[]
[]
[]
[]
[]
[]
[]
[]
[]
[]
[]
[]
[]
[]
[]
[]
[]
[]
[]
[]
[]
[]
[]
[]
[]
[]
[]
[]
[]
[]
[]
[]
[]
[]
[]
[]
[]
[]
[]
[]
[]
[]
[]
[]
[]
[]
[]
[]
[]
[]
[]
[]
[]
[]
[]
[]
[]
[]
[]
[]
[]
[]
[]
[]
[]
[]
[]
[]
[]
[]
[]
[]
[]
[]
[]
[]
[]
[]
[]
[]
[]
[]
[]
[]
[]
[]
[]
[]
[]
[]
[]
[]
[]
[]
[]
[]
[]
[]
[]
[]
[]
[]
[]
[]
[]
[]
[]
[]
[]
[]
[]
[]
[]
[]
[]
[]
[]
[]
[]
[]
[]
[]
[]
[]
[]
[]
[]
[]
[]
[]
[]
[]
[]
[]
[]
[]
[]
[]
[]
[]
[]
[]
[]
[]
[]
[]
[]
[]
[]
[]
[]
[]
[]
[]
[]
[]
[]
[]
[]
[]
[]
[]
[]
[]
[]
[]
[]
[]
[]
[]
[]
[]
[]
[]
[]
[]
[]
[]
[]
[]
[]
[]
[]
[]
[null,null,null,null,null,null,0]
[null,null,null,null,null,null,0]
[null,null,null,null,null,null,0]
[null,null,null,null,null,null,0]
[null,null,null,null,null,null,0]
[null,null,null,null,null,null,0]

{"sheet":"ファイル名抽出方法の詳細","index":3,"n_rows":1013,"n_cols":20,"rows_kept":1013,"cut":false,"hidden":false,"merged":[]}
[null,null,null,null,null,null,null,null,null,null,null,null,null,"SP","F","BIN",4,3,2,1]
["ファイル名抽出方法の詳細",null,null,null,null,null,null,null,null,null,null,null,null,null,1,{"$f":"IF(O2=\"\",\"\",DEC2BIN(O2,4))","v":"0001"},{"$f":"IF($P2=\"\",\"\",VALUE(MID($P2,1,1)))","v":0},{"$f":"IF($P2=\"\",\"\",VALUE(MID($P2,2,1)))","v":0},{"$f":"IF($P2=\"\",\"\",VALUE(MID($P2,3,1)))","v":0},{"$f":"IF($P2=\"\",\"\",VALUE(MID($P2,4,1)))","v":1}]
[null,null,null,null,null,null,null,null,null,null,null,null,null,null,null,{"$f":"IF(O3=\"\",\"\",DEC2BIN(O3,4))","v":""},{"$f":"IF($P3=\"\",\"\",VALUE(MID($P3,1,1)))","v":""},{"$f":"IF($P3=\"\",\"\",VALUE(MID($P3,2,1)))","v":""},{"$f":"IF($P3=\"\",\"\",VALUE(MID($P3,3,1)))","v":""},{"$f":"IF($P3=\"\",\"\",VALUE(MID($P3,4,1)))","v":""}]
[null,null,null,null,null,null,null,null,null,null,null,null,null,null,null,"","","","",""]
[null,"OCRにより抽出される各文字列は、下記の情報を持つ。",null,null,null,null,null,null,null,null,null,null,null,null,1,"0001",0,0,0,1]
[null,"　・文字数",null,null,null,null,null,null,null,null,null,null,null,null,1,"0001",0,0,0,1]
[null,"　・縦書き/横書き",null,null,null,null,null,null,null,null,null,null,null,null,1,"0001",0,0,0,1]
[null,"　・矩形位置(図4に示す top, bottom, left, rightの座標)",null,null,null,null,null,null,null,null,null,null,null,null,1,"0001",0,0,0,1]
[null,null,null,null,null,null,null,null,null,null,null,null,null,null,null,"","","","",""]
[null,null,null,null,null,null,null,null,null,null,null,null,null,null,null,"","","","",""]
[null,"下記の方法により、縦書き、横書きを含めた全文字列の評価値算出し、最大評価値の文字列をファイル名として抽出する。",null,null,null,null,null,null,null,null,null,null,null,null,1,"0001",0,0,0,1]
[null,null,null,null,null,null,null,null,null,null,null,null,null,null,null,"","","","",""]
[null,"　評価値 = 位置の評価値 + 文字サイズ評価値",null,null,null,null,null,null,null,null,null,null,null,null,1,"0001",0,0,0,1]
[null,null,null,null,null,null,null,null,null,null,null,null,null,null,null,"","","","",""]
[null,null,null,null,null,null,null,null,null,null,null,null,null,null,null,"","","","",""]
[null,"(1) 位置の評価値",null,null,null,null,null,null,null,null,null,null,null,null,1,"0001",0,0,0,1]
[null,null,null,null,null,null,null,null,null,null,null,null,null,null,null,"","","","",""]
[null,"　[横書きの場合]",null,null,null,null,null,null,null,null,null,null,null,null,1,"0001",0,0,0,1]
[null,"　　上下方向の優先度を上>下、左右方向の優先度を左>右とするため、",null,null,null,null,null,null,null,null,null,null,null,null,1,"0001",0,0,0,1]
[null,"　　画像の基点を左上(0, 0)とし、基点から文字列の基点(left, top)の距離が短いほど評価値が大きくなるように設定する(図4参照)",null,null,null,null,null,null,null,null,null,null,null,null,1,"0001",0,0,0,1]
[null,"　　位置の評価値 = α x (Width – left) + β x (Height – top)",null,null,null,null,null,null,null,null,null,null,null,null,1,"0001",0,0,0,1]
[null,null,null,null,null,null,null,null,null,null,null,null,null,null,null,"","","","",""]
[null,"　[縦書きの場合]",null,null,null,null,null,null,null,null,null,null,null,null,1,"0001",0,0,0,1]
[null,"　　上下方向の優先度を上>下、左右方向の優先度を左>右とするため、",null,null,null,null,null,null,null,null,null,null,null,null,1,"0001",0,0,0,1]
[null,"　　画像の基点を左上(0, 0)とし、基点から文字列の基点(left, top)の距離が短いほど評価値が大きくなるように設定する(図4参照)",null,null,null,null,null,null,null,null,null,null,null,null,1,"0001",0,0,0,1]
[null,"　　位置の評価値 = α x right + β x (Height – top)",null,null,null,null,null,null,null,null,null,null,null,null,1,"0001",0,0,0,1]
[null,null,null,null,null,null,null,null,null,null,null,null,null,null,null,"","","","",""]
[null,"※ α, βは上下方向と左右方向の重み係数 (横書きの場合α=3、β=2、縦書きの場合α=2、β=3を目安に調整する)",null,null,null,null,null,null,null,null,null,null,null,null,1,"0001",0,0,0,1]
[null,"　　また、原稿サイズによって、位置の評価値が大きく異なるため、A4サイズでの評価値に補正する。",null,null,null,null,null,null,null,null,null,null,null,null,1,"0001",0,0,0,1]
[null,null,null,null,null,null,null,null,null,null,null,null,null,null,null,"","","","",""]
[null,null,null,null,null,null,null,null,null,null,null,null,null,null,null,"","","","",""]
[null,"(2) 文字サイズの評価値",null,null,null,null,null,null,null,null,null,null,null,null,1,"0001",0,0,0,1]
[null,null,null,null,null,null,null,null,null,null,null,null,null,null,null,"","","","",""]
[null,"　文字サイズ評価値 = γ x 文字サイズ",null,null,null,null,null,null,null,null,null,null,null,null,1,"0001",0,0,0,1]
[null,"　※ γは文字サイズの影響度の重み係数 (γ=50を目安に調整する)",null,null,null,null,null,null,null,null,null,null,null,null,1,"0001",0,0,0,1]
[null,null,null,null,null,null,null,null,null,null,null,null,null,null,null,"","","","",""]
[null,"　[横書きの場合]",null,null,null,null,null,null,null,null,null,null,null,null,1,"0001",0,0,0,1]
[null,"　　文字列の幅を文字サイズとする。",null,null,null,null,null,null,null,null,null,null,null,null,1,"0001",0,0,0,1]
[null,"　　文字サイズ = bottom – top",null,null,null,null,null,null,null,null,null,null,null,null,1,"0001",0,0,0,1]
[null,null,null,null,null,null,null,null,null,null,null,null,null,null,null,"","","","",""]
[null,"　[縦書きの場合]",null,null,null,null,null,null,null,null,null,null,null,null,1,"0001",0,0,0,1]
[null,"　　文字列の幅は半角と全角で異なるため、文字列の長さを文字数で割った1文字あたりの長さを文字サイズとする。",null,null,null,null,null,null,null,null,null,null,null,null,1,"0001",0,0,0,1]
[null,"　　文字サイズ = (bottom - top) / 文字数",null,null,null,null,null,null,null,null,null,null,null,null,1,"0001",0,0,0,1]
[null,null,null,null,null,null,null,null,null,null,null,null,null,null,null,"","","","",""]
[null,null,null,null,null,null,null,null,null,null,null,null,null,null,null,"","","","",""]
[null,null,null,null,null,null,null,null,null,null,null,null,null,null,null,"","","","",""]
[null,null,null,null,null,null,null,null,null,null,null,null,null,null,null,"","","","",""]
[null,null,null,null,null,null,null,null,null,null,null,null,null,null,null,"","","","",""]
[null,null,null,null,null,null,null,null,null,null,null,null,null,null,null,"","","","",""]
[null,null,null,null,null,null,null,null,null,null,null,null,null,null,null,"","","","",""]
[null,null,null,null,null,null,null,null,null,null,null,null,null,null,null,"","","","",""]
[null,null,null,null,null,null,null,null,null,null,null,null,null,null,null,"","","","",""]
[null,null,null,null,null,null,null,null,null,null,null,null,null,null,null,"","","","",""]
[null,null,null,null,null,null,null,null,null,null,null,null,null,null,null,"","","","",""]
[null,null,null,null,null,null,null,null,null,null,null,null,null,null,null,"","","","",""]
[null,null,null,null,null,null,null,null,null,null,null,null,null,null,null,"","","","",""]
[null,null,null,null,null,null,null,null,null,null,null,null,null,null,null,"","","","",""]
[null,null,null,null,null,null,null,null,null,null,null,null,null,null,null,"","","","",""]
[null,null,null,null,null,null,null,null,null,null,null,null,null,null,null,"","","","",""]
[null,null,null,null,null,null,null,null,null,null,null,null,null,null,null,"","","","",""]
[null,null,null,null,null,null,null,null,null,null,null,null,null,null,null,"","","","",""]
[null,null,null,null,null,null,null,null,null,null,null,null,null,null,null,"","","","",""]
[null,null,null,null,null,null,null,null,null,null,null,null,null,null,null,"","","","",""]
[null,null,null,null,null,null,null,null,null,null,null,null,null,null,null,"","","","",""]
[null,null,null,null,null,null,null,null,null,null,null,null,null,null,null,"","","","",""]
[null,null,null,null,null,null,null,null,null,null,null,null,null,null,null,"","","","",""]
[null,null,null,null,null,null,null,null,null,null,null,null,null,null,null,{"$f":"IF(O67=\"\",\"\",DEC2BIN(O67,4))","v":""},{"$f":"IF($P67=\"\",\"\",VALUE(MID($P67,1,1)))","v":""},{"$f":"IF($P67=\"\",\"\",VALUE(MID($P67,2,1)))","v":""},{"$f":"IF($P67=\"\",\"\",VALUE(MID($P67,3,1)))","v":""},{"$f":"IF($P67=\"\",\"\",VALUE(MID($P67,4,1)))","v":""}]
[null,null,null,null,null,null,null,null,null,null,null,null,null,null,null,"","","","",""]
[null,null,null,null,null,null,null,null,null,null,null,null,null,null,null,"","","","",""]
[null,null,null,null,null,null,null,null,null,null,null,null,null,null,null,"","","","",""]
[null,"(3)抽出した文字列が1文字だった場合、OCRの誤検出が考えられる為、1文字の文字列はファイル名候補としない。(*1)",null,null,null,null,null,null,null,null,null,null,null,null,1,"0001",0,0,0,1]
[null,null,null,null,null,null,null,null,null,null,null,null,null,null,null,"","","","",""]
[null,null,null,null,null,null,null,null,null,null,null,null,null,null,null,"","","","",""]
[null,null,null,null,null,null,null,null,null,null,null,null,null,null,null,"","","","",""]
[null,null,null,null,null,null,null,null,null,null,null,null,null,null,null,"","","","",""]
[null,null,null,null,null,null,null,null,null,null,null,null,null,null,null,"","","","",""]
["【履歴】",null,null,null,null,null,null,null,null,null,null,null,null,null,1,"0001",0,0,0,1]
[null,"2010/9/21　初版　塚本　Minerva 1st対応。(UV-00780) サーチャブルPDFのファイル名生成機能",null,null,null,null,null,null,null,null,null,null,null,null,1,"0001",0,0,0,1]
[null,"2011/1/24　改訂　塚本　(*1)CQ:340309対応　抽出文字列が1文字の場合はファイル名候補としない",null,null,null,null,null,null,null,null,null,null,null,null,1,"0001",0,0,0,1]
[null,null,null,null,null,null,null,null,null,null,null,null,null,"e","e","e","e","e","e","e"]
[]
[]
[]
[]
[]
[]
[]
[]
[]
[]
[]
[]
[]
[]
[]
[]
[]
[]
[]
[]
[]
[]
[]
[]
[]
[]
[]
[]
[]
[]
[]
[]
[]
[]
[]
[]
[]
[]
[]
[]
[]
[]
[]
[]
[]
[]
[]
[]
[]
[]
[]
[]
[]
[]
[]
[]
[]
[]
[]
[]
[]
[]
[]
[]
[]
[]
[]
[]
[]
[]
[]
[]
[]
[]
[]
[]
[]
[]
[]
[]
[]
[]
[]
[]
[]
[]
[]
[]
[]
[]
[]
[]
[]
[]
[]
[]
[]
[]
[]
[]
[]
[]
[]
[]
[]
[]
[]
[]
[]
[]
[]
[]
[]
[]
[]
[]
[]
[]
[]
[]
[]
[]
[]
[]
[]
[]
[]
[]
[]
[]
[]
[]
[]
[]
[]
[]
[]
[]
[]
[]
[]
[]
[]
[]
[]
[]
[]
[]
[]
[]
[]
[]
[]
[]
[]
[]
[]
[]
[]
[]
[]
[]
[]
[]
[]
[]
[]
[]
[]
[]
[]
[]
[]
[]
[]
[]
[]
[]
[]
[]
[]
[]
[]
[]
[]
[]
[]
[]
[]
[]
[]
[]
[]
[]
[]
[]
[]
[]
[]
[]
[]
[]
[]
[]
[]
[]
[]
[]
[]
[]
[]
[]
[]
[]
[]
[]
[]
[]
[]
[]
[]
[]
[]
[]
[]
[]
[]
[]
[]
[]
[]
[]
[]
[]
[]
[]
[]
[]
[]
[]
[]
[]
[]
[]
[]
[]
[]
[]
[]
[]
[]
[]
[]
[]
[]
[]
[]
[]
[]
[]
[]
[]
[]
[]
[]
[]
[]
[]
[]
[]
[]
[]
[]
[]
[]
[]
[]
[]
[]
[]
[]
[]
[]
[]
[]
[]
[]
[]
[]
[]
[]
[]
[]
[]
[]
[]
[]
[]
[]
[]
[]
[]
[]
[]
[]
[]
[]
[]
[]
[]
[]
[]
[]
[]
[]
[]
[]
[]
[]
[]
[]
[]
[]
[]
[]
[]
[]
[]
[]
[]
[]
[]
[]
[]
[]
[]
[]
[]
[]
[]
[]
[]
[]
[]
[]
[]
[]
[]
[]
[]
[]
[]
[]
[]
[]
[]
[]
[]
[]
[]
[]
[]
[]
[]
[]
[]
[]
[]
[]
[]
[]
[]
[]
[]
[]
[]
[]
[]
[]
[]
[]
[]
[]
[]
[]
[]
[]
[]
[]
[]
[]
[]
[]
[]
[]
[]
[]
[]
[]
[]
[]
[]
[]
[]
[]
[]
[]
[]
[]
[]
[]
[]
[]
[]
[]
[]
[]
[]
[]
[]
[]
[]
[]
[]
[]
[]
[]
[]
[]
[]
[]
[]
[]
[]
[]
[]
[]
[]
[]
[]
[]
[]
[]
[]
[]
[]
[]
[]
[]
[]
[]
[]
[]
[]
[]
[]
[]
[]
[]
[]
[]
[]
[]
[]
[]
[]
[]
[]
[]
[]
[]
[]
[]
[]
[]
[]
[]
[]
[]
[]
[]
[]
[]
[]
[]
[]
[]
[]
[]
[]
[]
[]
[]
[]
[]
[]
[]
[]
[]
[]
[]
[]
[]
[]
[]
[]
[]
[]
[]
[]
[]
[]
[]
[]
[]
[]
[]
[]
[]
[]
[]
[]
[]
[]
[]
[]
[]
[]
[]
[]
[]
[]
[]
[]
[]
[]
[]
[]
[]
[]
[]
[]
[]
[]
[]
[]
[]
[]
[]
[]
[]
[]
[]
[]
[]
[]
[]
[]
[]
[]
[]
[]
[]
[]
[]
[]
[]
[]
[]
[]
[]
[]
[]
[]
[]
[]
[]
[]
[]
[]
[]
[]
[]
[]
[]
[]
[]
[]
[]
[]
[]
[]
[]
[]
[]
[]
[]
[]
[]
[]
[]
[]
[]
[]
[]
[]
[]
[]
[]
[]
[]
[]
[]
[]
[]
[]
[]
[]
[]
[]
[]
[]
[]
[]
[]
[]
[]
[]
[]
[]
[]
[]
[]
[]
[]
[]
[]
[]
[]
[]
[]
[]
[]
[]
[]
[]
[]
[]
[]
[]
[]
[]
[]
[]
[]
[]
[]
[]
[]
[]
[]
[]
[]
[]
[]
[]
[]
[]
[]
[]
[]
[]
[]
[]
[]
[]
[]
[]
[]
[]
[]
[]
[]
[]
[]
[]
[]
[]
[]
[]
[]
[]
[]
[]
[]
[]
[]
[]
[]
[]
[]
[]
[]
[]
[]
[]
[]
[]
[]
[]
[]
[]
[]
[]
[]
[]
[]
[]
[]
[]
[]
[]
[]
[]
[]
[]
[]
[]
[]
[]
[]
[]
[]
[]
[]
[]
[]
[]
[]
[]
[]
[]
[]
[]
[]
[]
[]
[]
[]
[]
[]
[]
[]
[]
[]
[]
[]
[]
[]
[]
[]
[]
[]
[]
[]
[]
[]
[]
[]
[]
[]
[]
[]
[]
[]
[]
[]
[]
[]
[]
[]
[]
[]
[]
[]
[]
[]
[]
[]
[]
[]
[]
[]
[]
[]
[]
[]
[]
[]
[]
[]
[]
[]
[]
[]
[]
[]
[]
[]
[]
[]
[]
[]
[]
[]
[]
[]
[]
[]
[]
[]
[]
[]
[]
[]
[]
[]
[]
[]
[]
[]
[]
[]
[]
[]
[]
[]
[]
[]
[]
[]
[]
[]
[]
[]
[]
[]
[]
[]
[]
[]
[]
[]
[]
[]
[]
[]
[]
[]
[]
[]
[]
[]
[]
[]
[]
[]
[]
[]
[]
[]
[]
[]
[]
[]
[]
[]
[]
[]
[]
[]
[]
[]
[]
[]
[]
[]
[]
[]
[]
[]
[]
[]
[]
[]
[]
[]
[]
[]
[]
[]
[]
[]
[]
[]
[]
[]
[]
[]
[]
[]
[]
[]
[]
[]
[]
[]
[]
[]
[]
[null,null,null,null,null,null,null,null,null,null,null,null,null,0]
[null,null,null,null,null,null,null,null,null,null,null,null,null,0]
[null,null,null,null,null,null,null,null,null,null,null,null,null,0]
[null,null,null,null,null,null,null,null,null,null,null,null,null,0]
[null,null,null,null,null,null,null,null,null,null,null,null,null,0]
[null,null,null,null,null,null,null,null,null,null,null,null,null,0]
[null,null,null,null,null,null,null,null,null,null,null,null,null,0]
[null,null,null,null,null,null,null,null,null,null,null,null,null,0]
[null,null,null,null,null,null,null,null,null,null,null,null,null,0]
[null,null,null,null,null,null,null,null,null,null,null,null,null,0]
[null,null,null,null,null,null,null,null,null,null,null,null,null,0]
[null,null,null,null,null,null,null,null,null,null,null,null,null,0]
[null,null,null,null,null,null,null,null,null,null,null,null,null,0]

{"sheet":"（参考）SearchablePDF対応欧州言語一覧","index":4,"n_rows":1015,"n_cols":34,"rows_kept":1015,"cut":false,"hidden":false,"merged":[]}
[null,null,null,null,null,null,null,null,null,null,null,null,null,null,null,"SP","F","BIN",4,3,2,1]
[null,"●OCR対応言語一覧",null,null,null,null,null,null,null,null,null,null,null,null,null,null,1,{"$f":"IF(Q2=\"\",\"\",DEC2BIN(Q2,4))","v":"0001"},{"$f":"IF($R2=\"\",\"\",VALUE(MID($R2,1,1)))","v":0},{"$f":"IF($R2=\"\",\"\",VALUE(MID($R2,2,1)))","v":0},{"$f":"IF($R2=\"\",\"\",VALUE(MID($R2,3,1)))","v":0},{"$f":"IF($R2=\"\",\"\",VALUE(MID($R2,4,1)))","v":1}]
[null,null,null,null,null,null,null,null,null,null,null,null,null,null,null,null,null,{"$f":"IF(Q3=\"\",\"\",DEC2BIN(Q3,4))","v":""},{"$f":"IF($R3=\"\",\"\",VALUE(MID($R3,1,1)))","v":""},{"$f":"IF($R3=\"\",\"\",VALUE(MID($R3,2,1)))","v":""},{"$f":"IF($R3=\"\",\"\",VALUE(MID($R3,3,1)))","v":""},{"$f":"IF($R3=\"\",\"\",VALUE(MID($R3,4,1)))","v":""}]
[null,null,null,"言語",null,null,null,null,"アジア系言語","優先順位",null,null,"欧州系言語","優先順位",null,null,1,"0001",0,0,0,1,null,null,null,null,null,null,null,null,null,"優先順位"]
[null,1,"Japanese","日本語",null,null,null,1,"日本語",1,null,1,"英語",1,null,null,1,"0001",0,0,0,1,null,1,"Japanese",null,null,null,null,1,null,1,null,1]
[null,2,"English","英語",null,null,null,2,"中国語",2,null,2,"フランス語",2,null,null,1,"0001",0,0,0,1,null,2,"English",null,null,null,null,2,null,2,null,2]
[null,3,"French","フランス語",null,null,null,3,"台湾語",2,null,3,"イタリア語",2,null,null,1,"0001",0,0,0,1,null,3,"French",null,null,null,null,3,null,2,null,3]
[null,4,"Italian","イタリア語",null,null,null,4,"韓国語",2,null,4,"ドイツ語",2,null,null,1,"0001",0,0,0,1,null,4,"Italian",null,null,null,null,4,null,2,null,4]
[null,5,"German","ドイツ語",null,null,null,null,null,null,null,5,"スペイン語",2,null,null,1,"0001",0,0,0,1,null,5,"German",null,null,null,null,null,null,null,null,5]
[null,6,"Spanish","スペイン語",null,null,null,null,null,null,null,6,"オランダ語",3,null,null,1,"0001",0,0,0,1,null,6,"Spanish",null,null,null,null,null,null,null,null,6]
[null,7,"Chinese1","中国語","簡体字：Simplified characters",null,null,null,null,null,null,7,"デンマーク語",3,null,null,1,"0001",0,0,0,1,null,7,"Chinese1",null,null,null,null,null,null,null,null,7]
[null,8,"Chinese2(Taiwanese)","台湾語","繁体字：Shigetaige",null,null,null,null,null,null,8,"ノルウェー語",3,null,null,1,"0001",0,0,0,1,null,8,"Chinese2(Taiwanese)",null,null,null,null,null,null,null,null,8]
[null,9,"Korean","韓国語",null,null,null,null,null,null,null,9,"スウェーデン語",3,null,null,1,"0001",0,0,0,1,null,9,"Korean",null,null,null,null,null,null,null,null,9]
[null,10,"Dutch","オランダ語",null,null,null,null,null,null,null,10,"フィンランド語",3,null,null,1,"0001",0,0,0,1,null,10,"Dutch",null,null,null,null,null,null,null,null,10]
[null,11,"Danish","デンマーク語",null,null,null,null,null,null,null,11,"ポルトガル語",3,null,null,1,"0001",0,0,0,1,null,11,"Danish",null,null,null,null,null,null,null,null,11]
[null,12,"Norwegian","ノルウェー語",null,null,null,null,null,null,null,12,"トルコ語",3,null,null,1,"0001",0,0,0,1,null,12,"Norwegian",null,null,null,null,null,null,null,null,12]
[null,13,"Swedish","スウェーデン語",null,null,null,null,null,null,null,13,"ギリシャ語",3,null,null,1,"0001",0,0,0,1,null,13,"Swedish",null,null,null,null,null,null,null,null,13]
[null,14,"Finnish","フィンランド語",null,null,null,null,null,null,null,14,"チェコ語",3,null,null,1,"0001",0,0,0,1,null,14,"Finnish",null,null,null,null,null,null,null,null,14]
[null,15,"Portuguese","ポルトガル語",null,null,null,null,null,null,null,15,"ポーランド語",3,null,null,1,"0001",0,0,0,1,null,15,"Portuguese",null,null,null,null,null,null,null,null,15]
[null,16,"Turkish","トルコ語",null,null,null,null,null,null,null,16,"ハンガリー語",3,null,null,1,"0001",0,0,0,1,null,16,"Turkish",null,null,null,null,null,null,null,null,16]
[null,17,"Greek","ギリシャ語",null,null,null,null,null,null,null,17,"スロバキア語",3,null,null,1,"0001",0,0,0,1,null,17,"Greek",null,null,null,null,null,null,null,null,17]
[null,18,"Czech","チェコ語",null,null,null,null,null,null,null,18,"ロシア語",3,null,null,1,"0001",0,0,0,1,null,18,"Czech",null,null,null,null,null,null,null,null,18]
[null,19,"Polish","ポーランド語",null,null,null,null,null,null,null,19,"カタロニア語",4,null,null,1,"0001",0,0,0,1,null,19,"Polish",null,null,null,null,null,null,null,null,19]
[null,20,"Hungarian","ハンガリー語",null,null,null,null,null,null,null,20,"リトアニア語",4,null,null,1,"0001",0,0,0,1,null,20,"Hungarian",null,null,null,null,null,null,null,null,20]
[null,21,"Slovak","スロバキア語",null,null,null,null,null,null,null,21,"エストニア語",4,null,null,1,"0001",0,0,0,1,null,21,"Slovak",null,null,null,null,null,null,null,null,21]
[null,22,"Russian","ロシア語",null,null,null,null,null,null,null,22,"ラトビア語",4,null,null,1,"0001",0,0,0,1,null,22,"Russian",null,null,null,null,null,null,null,null,22]
[null,23,"Catalan","カタロニア語",null,null,null,null,null,null,null,23,"スロベニア語",4,null,null,1,"0001",0,0,0,1,null,23,"Catalan",null,null,null,null,null,null,null,null,23]
[null,24,"Lithuanian","リトアニア語",null,null,null,null,null,null,null,24,"ルーマニア語",4,null,null,1,"0001",0,0,0,1,null,24,"Lithuanian",null,null,null,null,null,null,null,null,24]
[null,25,"Estonian","エストニア語",null,null,null,null,null,null,null,25,"ウクライナ語",4,null,null,1,"0001",0,0,0,1,null,25,"Estonian",null,null,null,null,null,null,null,null,25]
[null,26,"Latvian","ラトビア語",null,null,null,null,null,null,null,26,"ブルガリア語",5,null,null,1,"0001",0,0,0,1,null,26,"Latvian",null,null,null,null,null,null,null,null,26]
[null,27,"Slovenia","スロベニア語",null,null,null,null,null,null,null,27,"クロアチア語",5,null,null,1,"0001",0,0,0,1,null,27,"Slovenia",null,null,null,null,null,null,null,null,27]
[null,28,"Romanian","ルーマニア語",null,null,null,null,null,null,null,null,null,null,null,null,1,"0001",0,0,0,1,null,28,"Romanian"]
[null,29,"Ukrainian","ウクライナ語",null,null,null,null,null,null,null,null,null,null,null,null,1,"0001",0,0,0,1,null,29,"Ukrainian"]
[null,30,"Bulgarian","ブルガリア語",null,null,null,null,null,null,null,null,null,null,null,null,1,"0001",0,0,0,1,null,30,"Bulgarian"]
[null,31,"Croatian","クロアチア語",null,null,null,null,null,null,null,null,null,null,null,null,1,"0001",0,0,0,1,null,31,"Croatian"]
[null,null,null,null,null,null,null,null,null,null,null,null,null,null,null,null,null,"","","","",""]
[null,null,"08/07/26　初版　伊藤（代理修正：米澤）",null,null,null,null,null,null,null,null,null,null,null,null,null,1,"0001",0,0,0,1]
[null,null,"Amur対応。(UV-00583) サーチャブルPDF生成機能",null,null,null,null,null,null,null,null,null,null,null,null,null,1,"0001",0,0,0,1]
[null,null,null,null,null,null,null,null,null,null,null,null,null,null,null,"e","e","e","e","e","e","e"]
[]
[]
[]
[]
[]
[]
[]
[]
[]
[]
[]
[]
[]
[]
[]
[]
[]
[]
[]
[]
[]
[]
[]
[]
[]
[]
[]
[]
[]
[]
[]
[]
[]
[]
[]
[]
[]
[]
[]
[]
[]
[]
[]
[]
[]
[]
[]
[]
[]
[]
[]
[]
[]
[]
[]
[]
[]
[]
[]
[]
[]
[]
[]
[]
[]
[]
[]
[]
[]
[]
[]
[]
[]
[]
[]
[]
[]
[]
[]
[]
[]
[]
[]
[]
[]
[]
[]
[]
[]
[]
[]
[]
[]
[]
[]
[]
[]
[]
[]
[]
[]
[]
[]
[]
[]
[]
[]
[]
[]
[]
[]
[]
[]
[]
[]
[]
[]
[]
[]
[]
[]
[]
[]
[]
[]
[]
[]
[]
[]
[]
[]
[]
[]
[]
[]
[]
[]
[]
[]
[]
[]
[]
[]
[]
[]
[]
[]
[]
[]
[]
[]
[]
[]
[]
[]
[]
[]
[]
[]
[]
[]
[]
[]
[]
[]
[]
[]
[]
[]
[]
[]
[]
[]
[]
[]
[]
[]
[]
[]
[]
[]
[]
[]
[]
[]
[]
[]
[]
[]
[]
[]
[]
[]
[]
[]
[]
[]
[]
[]
[]
[]
[]
[]
[]
[]
[]
[]
[]
[]
[]
[]
[]
[]
[]
[]
[]
[]
[]
[]
[]
[]
[]
[]
[]
[]
[]
[]
[]
[]
[]
[]
[]
[]
[]
[]
[]
[]
[]
[]
[]
[]
[]
[]
[]
[]
[]
[]
[]
[]
[]
[]
[]
[]
[]
[]
[]
[]
[]
[]
[]
[]
[]
[]
[]
[]
[]
[]
[]
[]
[]
[]
[]
[]
[]
[]
[]
[]
[]
[]
[]
[]
[]
[]
[]
[]
[]
[]
[]
[]
[]
[]
[]
[]
[]
[]
[]
[]
[]
[]
[]
[]
[]
[]
[]
[]
[]
[]
[]
[]
[]
[]
[]
[]
[]
[]
[]
[]
[]
[]
[]
[]
[]
[]
[]
[]
[]
[]
[]
[]
[]
[]
[]
[]
[]
[]
[]
[]
[]
[]
[]
[]
[]
[]
[]
[]
[]
[]
[]
[]
[]
[]
[]
[]
[]
[]
[]
[]
[]
[]
[]
[]
[]
[]
[]
[]
[]
[]
[]
[]
[]
[]
[]
[]
[]
[]
[]
[]
[]
[]
[]
[]
[]
[]
[]
[]
[]
[]
[]
[]
[]
[]
[]
[]
[]
[]
[]
[]
[]
[]
[]
[]
[]
[]
[]
[]
[]
[]
[]
[]
[]
[]
[]
[]
[]
[]
[]
[]
[]
[]
[]
[]
[]
[]
[]
[]
[]
[]
[]
[]
[]
[]
[]
[]
[]
[]
[]
[]
[]
[]
[]
[]
[]
[]
[]
[]
[]
[]
[]
[]
[]
[]
[]
[]
[]
[]
[]
[]
[]
[]
[]
[]
[]
[]
[]
[]
[]
[]
[]
[]
[]
[]
[]
[]
[]
[]
[]
[]
[]
[]
[]
[]
[]
[]
[]
[]
[]
[]
[]
[]
[]
[]
[]
[]
[]
[]
[]
[]
[]
[]
[]
[]
[]
[]
[]
[]
[]
[]
[]
[]
[]
[]
[]
[]
[]
[]
[]
[]
[]
[]
[]
[]
[]
[]
[]
[]
[]
[]
[]
[]
[]
[]
[]
[]
[]
[]
[]
[]
[]
[]
[]
[]
[]
[]
[]
[]
[]
[]
[]
[]
[]
[]
[]
[]
[]
[]
[]
[]
[]
[]
[]
[]
[]
[]
[]
[]
[]
[]
[]
[]
[]
[]
[]
[]
[]
[]
[]
[]
[]
[]
[]
[]
[]
[]
[]
[]
[]
[]
[]
[]
[]
[]
[]
[]
[]
[]
[]
[]
[]
[]
[]
[]
[]
[]
[]
[]
[]
[]
[]
[]
[]
[]
[]
[]
[]
[]
[]
[]
[]
[]
[]
[]
[]
[]
[]
[]
[]
[]
[]
[]
[]
[]
[]
[]
[]
[]
[]
[]
[]
[]
[]
[]
[]
[]
[]
[]
[]
[]
[]
[]
[]
[]
[]
[]
[]
[]
[]
[]
[]
[]
[]
[]
[]
[]
[]
[]
[]
[]
[]
[]
[]
[]
[]
[]
[]
[]
[]
[]
[]
[]
[]
[]
[]
[]
[]
[]
[]
[]
[]
[]
[]
[]
[]
[]
[]
[]
[]
[]
[]
[]
[]
[]
[]
[]
[]
[]
[]
[]
[]
[]
[]
[]
[]
[]
[]
[]
[]
[]
[]
[]
[]
[]
[]
[]
[]
[]
[]
[]
[]
[]
[]
[]
[]
[]
[]
[]
[]
[]
[]
[]
[]
[]
[]
[]
[]
[]
[]
[]
[]
[]
[]
[]
[]
[]
[]
[]
[]
[]
[]
[]
[]
[]
[]
[]
[]
[]
[]
[]
[]
[]
[]
[]
[]
[]
[]
[]
[]
[]
[]
[]
[]
[]
[]
[]
[]
[]
[]
[]
[]
[]
[]
[]
[]
[]
[]
[]
[]
[]
[]
[]
[]
[]
[]
[]
[]
[]
[]
[]
[]
[]
[]
[]
[]
[]
[]
[]
[]
[]
[]
[]
[]
[]
[]
[]
[]
[]
[]
[]
[]
[]
[]
[]
[]
[]
[]
[]
[]
[]
[]
[]
[]
[]
[]
[]
[]
[]
[]
[]
[]
[]
[]
[]
[]
[]
[]
[]
[]
[]
[]
[]
[]
[]
[]
[]
[]
[]
[]
[]
[]
[]
[]
[]
[]
[]
[]
[]
[]
[]
[]
[]
[]
[]
[]
[]
[]
[]
[]
[]
[]
[]
[]
[]
[]
[]
[]
[]
[]
[]
[]
[]
[]
[]
[]
[]
[]
[]
[]
[]
[]
[]
[]
[]
[]
[]
[]
[]
[]
[]
[]
[]
[]
[]
[]
[]
[]
[]
[]
[]
[]
[]
[]
[]
[]
[]
[]
[]
[]
[]
[]
[]
[]
[]
[]
[]
[]
[]
[]
[]
[]
[]
[]
[]
[]
[]
[]
[]
[]
[]
[]
[]
[]
[]
[null,null,null,null,null,null,null,null,null,null,null,null,null,null,null,0]
[null,null,null,null,null,null,null,null,null,null,null,null,null,null,null,0]
[null,null,null,null,null,null,null,null,null,null,null,null,null,null,null,0]
[null,null,null,null,null,null,null,null,null,null,null,null,null,null,null,0]
[null,null,null,null,null,null,null,null,null,null,null,null,null,null,null,0]
[null,null,null,null,null,null,null,null,null,null,null,null,null,null,null,0]
[null,null,null,null,null,null,null,null,null,null,null,null,null,null,null,0]
[null,null,null,null,null,null,null,null,null,null,null,null,null,null,null,0]
[null,null,null,null,null,null,null,null,null,null,null,null,null,null,null,0]
[null,null,null,null,null,null,null,null,null,null,null,null,null,null,null,1]
[null,null,null,null,null,null,null,null,null,null,null,null,null,null,null,0]
[null,null,null,null,null,null,null,null,null,null,null,null,null,null,null,0]
[null,null,null,null,null,null,null,null,null,null,null,null,null,null,null,0]
[null,null,null,null,null,null,null,null,null,null,null,null,null,null,null,1]
[null,null,null,null,null,null,null,null,null,null,null,null,null,null,null,0]

{"sheet":"（参考）禁則表1(PSP記載読込設定同士の組禁)","index":5,"n_rows":1034,"n_cols":71,"rows_kept":1034,"cut":false,"hidden":false,"merged":[[12,1,24,1],[25,1,37,1],[9,17,9,29],[9,4,9,16],[32,2,37,2],[10,17,10,19],[10,20,10,23],[10,24,10,29],[10,7,10,10],[10,11,10,16],[10,4,10,6],[25,2,27,2],[28,2,31,2],[12,2,14,2],[15,2,18,2],[19,2,24,2],[9,45,9,57],[9,58,9,70],[10,45,10,47],[10,48,10,51],[10,52,10,57],[10,58,10,60],[10,61,10,64],[10,65,10,70],[12,42,24,42],[12,43,14,43],[15,43,18,43],[19,43,24,43],[25,42,37,42],[25,43,27,43],[28,43,31,43],[32,43,37,43]]}
[null,null,null,null,null,null,null,null,null,null,null,null,null,null,null,null,null,null,null,null,null,null,null,null,null,null,null,null,null,null,null,null,null,null,"SP","F","BIN",4,3,2,1]
[null,"★Distributed　Scan対応当時の検討資料",null,null,null,null,null,null,null,null,null,null,null,null,null,null,null,null,null,null,null,null,null,null,null,null,null,null,null,null,null,null,null,null,null,1,{"$f":"IF(AJ2=\"\",\"\",DEC2BIN(AJ2,4))","v":"0001"},{"$f":"IF($AK2=\"\",\"\",VALUE(MID($AK2,1,1)))","v":0},{"$f":"IF($AK2=\"\",\"\",VALUE(MID($AK2,2,1)))","v":0},{"$f":"IF($AK2=\"\",\"\",VALUE(MID($AK2,3,1)))","v":0},{"$f":"IF($AK2=\"\",\"\",VALUE(MID($AK2,4,1)))","v":1}]
[null,null,null,null,null,null,null,null,null,null,null,null,null,null,null,null,null,null,null,null,null,null,null,null,null,null,null,null,null,null,null,null,null,null,null,null,{"$f":"IF(AJ3=\"\",\"\",DEC2BIN(AJ3,4))","v":""},{"$f":"IF($AK3=\"\",\"\",VALUE(MID($AK3,1,1)))","v":""},{"$f":"IF($AK3=\"\",\"\",VALUE(MID($AK3,2,1)))","v":""},{"$f":"IF($AK3=\"\",\"\",VALUE(MID($AK3,3,1)))","v":""},{"$f":"IF($AK3=\"\",\"\",VALUE(MID($AK3,4,1)))","v":""}]
[null,"PSP設定値同士の組禁",null,null,null,null,null,null,null,null,null,null,null,null,null,null,null,null,null,null,null,null,null,null,null,null,null,null,null,null,null,null,null,null,null,1,"0001",0,0,0,1]
[null,null,"PSP記載パラメータ同士の組み合わせ禁止表を以下にします。",null,null,null,null,null,null,null,null,null,null,null,null,null,null,null,null,null,null,null,null,null,null,null,null,null,null,null,null,null,null,null,null,1,"0001",0,0,0,1]
[null,null,"PSP設定値をパネル設定に反映する際の組禁表です。(*2)",null,null,null,null,null,null,null,null,null,null,null,null,null,null,null,null,null,null,null,null,null,null,null,null,null,null,null,null,null,null,null,null,1,"0001",0,0,0,1]
[null,null,"PSP設定値同士の組禁パターンを記載しています。",null,null,null,null,null,null,null,null,null,null,null,null,null,null,null,null,null,null,null,null,null,null,null,null,null,null,null,null,null,null,null,null,1,"0001",0,0,0,1]
[null,null,null,null,null,null,null,null,null,null,null,null,null,null,null,null,null,null,null,null,null,null,null,null,null,null,null,null,null,null,null,null,null,null,null,null,"","","","",""]
[null,null,null,null,null,null,null,null,null,null,null,null,null,null,null,null,null,null,null,null,null,null,null,null,null,null,null,null,null,null,null,null,null,null,null,null,"","","","",""]
[null,null,null,null,"上書き禁止",null,null,null,null,null,null,null,null,null,null,null,null,"上書き許可",null,null,null,null,null,null,null,null,null,null,null,null,null,null,null,null,null,1,"0001",0,0,0,1]
[null,null,null,null,"カラーモード",null,null,"解像度",null,null,null,"画像フォーマット",null,null,null,null,null,"カラーモード",null,null,"解像度",null,null,null,"画像フォーマット",null,null,null,null,null,null,null,null,null,null,1,"0001",0,0,0,1]
[null,null,null,null,{"$f":"D13","v":"フルカラー"},{"$f":"D14","v":"グレースケール"},null,"２００ｄｐｉ（精細）","３００ｄｐｉ","４００ｄｐｉ（高精細）","６００ｄｐｉ（超高精細）","ＪＰＥＧ","ＴＩＦＦ","ＰＤＦ","コンパクトＰＤＦ","XPS","コンパクトXPS","フルカラー","グレースケール","白黒2値","２００ｄｐｉ（精細）","３００ｄｐｉ","４００ｄｐｉ（高精細）","６００ｄｐｉ（超高精細）","ＪＰＥＧ","ＴＩＦＦ","ＰＤＦ","コンパクトＰＤＦ","XPS","コンパクトXPS",null,null,null,null,null,1,"0001",0,0,0,1]
[null,"上書き禁止","カラーモード","フルカラー",null,null,null,"○","○","○","○","○","○","○","○","○","○",null,null,null,"○","○","○","○","○","○","○","○","○","○",null,null,null,null,null,1,"0001",0,0,0,1,null,null,null,null,null,null,null,"○","○","○","○","○","○","○","○","○","○",null,null,null,"○","○","○","○","○","○","○","○","○","○"]
[null,null,null,"グレースケール",null,null,null,"○","○","○","○","○","○","○","*22","○","○",null,null,null,"○","○","○","○","○","○","○","*22","○","○",null,null,null,null,null,1,"0001",0,0,0,1,null,null,null,null,null,null,null,"○","○","○","○","○","○","○","*22","○","○",null,null,null,"○","○","○","○","○","○","○","*22","○","○"]
[null,null,null,"白黒2値",null,null,null,null,"○","○","○","×","○","○","×②(*1)","○","×③(*1)",null,null,null,"○","○","○","○","①","○","○","②","○","③",null,null,null,null,null,1,"0001",0,0,0,1,null,null,null,null,null,null,null,null,"○","○","○","×","○","○","×②(*1)","○","×③(*1)",null,null,null,"○","○","○","○","①","○","○","②","○","③"]
[null,null,"解像度","２００ｄｐｉ（精細）",null,null,null,null,null,null,null,"○","○","○","○","○","○","○","○","○",null,null,null,null,"○","○","○","○","○","○",null,null,null,null,null,1,"0001",0,0,0,1,null,null,null,null,null,null,null,null,null,null,null,"○","○","○","○","○","○","○","○","○",null,null,null,null,"○","○","○","○","○","○"]
[null,null,null,"３００ｄｐｉ",null,null,null,null,null,null,null,"○","○","○","○","○","○","○","○","○",null,null,null,null,"○","○","○","○","○","○",null,null,null,null,null,1,"0001",0,0,0,1,null,null,null,null,null,null,null,null,null,null,null,"○","○","○","○","○","○","○","○","○",null,null,null,null,"○","○","○","○","○","○"]
[null,null,null,"４００ｄｐｉ（高精細）",null,null,null,null,null,null,null,"○","○","○","○","○","○","○","○","○",null,null,null,null,"○","○","○","○","○","○",null,null,null,null,null,1,"0001",0,0,0,1,null,null,null,null,null,null,null,null,null,null,null,"○","○","○","○","○","○","○","○","○",null,null,null,null,"○","○","○","○","○","○"]
[null,null,null,"６００ｄｐｉ（超高精細）",null,null,null,null,null,null,null,"○","○","○","○","○","○","○","○","○",null,null,null,null,"○","○","○","○","○","○",null,null,null,null,null,1,"0001",0,0,0,1,null,null,null,null,null,null,null,null,null,null,null,"○","○","○","○","○","○","○","○","○",null,null,null,null,"○","○","○","○","○","○"]
[null,null,"画像フォーマット","ＪＰＥＧ",null,null,null,null,null,null,null,null,null,null,null,null,null,"○","○","④","○","○","○","○",null,null,null,null,null,null,null,null,null,null,null,1,"0001",0,0,0,1,null,null,null,null,null,null,null,null,null,null,null,null,null,null,null,null,null,"○","○","④","○","○","○","○"]
[null,null,null,"ＴＩＦＦ",null,null,null,null,null,null,null,null,null,null,null,null,null,"○","○","○","○","○","○","○",null,null,null,null,null,null,null,null,null,null,null,1,"0001",0,0,0,1,null,null,null,null,null,null,null,null,null,null,null,null,null,null,null,null,null,"○","○","○","○","○","○","○"]
[null,null,null,"ＰＤＦ",null,null,null,null,null,null,null,null,null,null,null,null,null,"○","○","○","○","○","○","○",null,null,null,null,null,null,null,null,null,null,null,1,"0001",0,0,0,1,null,null,null,null,null,null,null,null,null,null,null,null,null,null,null,null,null,"○","○","○","○","○","○","○"]
[null,null,null,"コンパクトＰＤＦ",null,null,null,null,null,null,null,null,null,null,null,null,null,"○","*22","④*","○","○","○","○",null,null,null,null,null,null,null,null,null,null,null,1,"0001",0,0,0,1,null,null,null,null,null,null,null,null,null,null,null,null,null,null,null,null,null,"○","*22","④*","○","○","○","○"]
[null,null,null,"XPS",null,null,null,null,null,null,null,null,null,null,null,null,null,"○","○","○","○","○","○","○",null,null,null,null,null,null,null,null,null,null,null,1,"0001",0,0,0,1,null,null,null,null,null,null,null,null,null,null,null,null,null,null,null,null,null,"○","○","○","○","○","○","○"]
[null,null,null,"コンパクトXPS",null,null,null,null,null,null,null,null,null,null,null,null,null,"○","○","④*","○","○","○","○",null,null,null,null,null,null,null,null,null,null,null,1,"0001",0,0,0,1,null,null,null,null,null,null,null,null,null,null,null,null,null,null,null,null,null,"○","○","④*","○","○","○","○"]
[null,"上書き許可","カラーモード","フルカラー",null,null,null,null,null,null,null,null,null,null,null,null,null,null,null,null,"○","○","○","○","○","○","○","○","○","○",null,null,null,null,null,1,"0001",0,0,0,1,null,null,null,null,null,null,null,null,null,null,null,null,null,null,null,null,null,null,null,null,"○","○","○","○","○","○","○","○","○","○"]
[null,null,null,"グレースケール",null,null,null,null,null,null,null,null,null,null,null,null,null,null,null,null,"○","○","○","○","○","○","○","*22","○","○",null,null,null,null,null,1,"0001",0,0,0,1,null,null,null,null,null,null,null,null,null,null,null,null,null,null,null,null,null,null,null,null,"○","○","○","○","○","○","○","*22","○","○"]
[null,null,null,"白黒2値",null,null,null,null,null,null,null,null,null,null,null,null,null,null,null,null,"○","○","○","○","④","○","○","④*","○","④*",null,null,null,null,null,1,"0001",0,0,0,1,null,null,null,null,null,null,null,null,null,null,null,null,null,null,null,null,null,null,null,null,"○","○","○","○","④","○","○","④*","○","④*"]
[null,null,"解像度","２００ｄｐｉ（精細）",null,null,null,null,null,null,null,null,null,null,null,null,null,null,null,null,null,null,null,null,"○","○","○","○","○","○",null,null,null,null,null,1,"0001",0,0,0,1,null,null,null,null,null,null,null,null,null,null,null,null,null,null,null,null,null,null,null,null,null,null,null,null,"○","○","○","○","○","○"]
[null,null,null,"３００ｄｐｉ",null,null,null,null,null,null,null,null,null,null,null,null,null,null,null,null,null,null,null,null,"○","○","○","○","○","○",null,null,null,null,null,1,"0001",0,0,0,1,null,null,null,null,null,null,null,null,null,null,null,null,null,null,null,null,null,null,null,null,null,null,null,null,"○","○","○","○","○","○"]
[null,null,null,"４００ｄｐｉ（高精細）",null,null,null,null,null,null,null,null,null,null,null,null,null,null,null,null,null,null,null,null,"○","○","○","○","○","○",null,null,null,null,null,1,"0001",0,0,0,1,null,null,null,null,null,null,null,null,null,null,null,null,null,null,null,null,null,null,null,null,null,null,null,null,"○","○","○","○","○","○"]
[null,null,null,"６００ｄｐｉ（超高精細）",null,null,null,null,null,null,null,null,null,null,null,null,null,null,null,null,null,null,null,null,"○","○","○","○","○","○",null,null,null,null,null,1,"0001",0,0,0,1,null,null,null,null,null,null,null,null,null,null,null,null,null,null,null,null,null,null,null,null,null,null,null,null,"○","○","○","○","○","○"]
[null,null,"画像フォーマット","ＪＰＥＧ",null,null,null,null,null,null,null,null,null,null,null,null,null,null,null,null,null,null,null,null,null,null,null,null,null,null,null,null,null,null,null,1,"0001",0,0,0,1]
[null,null,null,"ＴＩＦＦ",null,null,null,null,null,null,null,null,null,null,null,null,null,null,null,null,null,null,null,null,null,null,null,null,null,null,null,null,null,null,null,1,"0001",0,0,0,1]
[null,null,null,"ＰＤＦ",null,null,null,null,null,null,null,null,null,null,null,null,null,null,null,null,null,null,null,null,null,null,null,null,null,null,null,null,null,null,null,1,"0001",0,0,0,1]
[null,null,null,"コンパクトＰＤＦ",null,null,null,null,null,null,null,null,null,null,null,null,null,null,null,null,null,null,null,null,null,null,null,null,null,null,null,null,null,null,null,1,"0001",0,0,0,1]
[null,null,null,"XPS",null,null,null,null,null,null,null,null,null,null,null,null,null,null,null,null,null,null,null,null,null,null,null,null,null,null,null,null,null,null,null,1,"0001",0,0,0,1]
[null,null,null,"コンパクトXPS",null,null,null,null,null,null,null,null,null,null,null,null,null,null,null,null,null,null,null,null,null,null,null,null,null,null,null,null,null,null,null,1,"0001",0,0,0,1]
[null,null,null,null,null,null,null,null,null,null,null,null,null,null,null,null,null,null,null,null,null,null,null,null,null,null,null,null,null,null,null,null,null,null,null,null,"","","","",""]
[null,null,null,"【履　　歴】","2009/1/29　新規作成　姉崎",null,null,null,null,null,null,null,null,null,null,null,null,null,null,null,null,null,null,null,null,null,null,null,null,null,null,null,null,null,null,1,"0001",0,0,0,1]
[null,null,null,null,"2009/6/4　第2版　姉崎(*1)",null,null,null,null,null,null,null,null,null,null,null,null,null,null,null,null,null,null,null,null,null,null,null,null,null,null,null,null,null,null,1,"0001",0,0,0,1]
[null,null,null,null,null,"コンパクトPDF（XPS）、白黒2値で、フォーマット、カラーモード共に上書き禁止",null,null,null,null,null,null,null,null,null,null,null,null,null,null,null,null,null,null,null,null,null,null,null,null,null,null,null,null,null,1,"0001",0,0,0,1]
[null,null,null,null,null,"の場合の対応を×→②（XPSの場合は③）に修正",null,null,null,null,null,null,null,null,null,null,null,null,null,null,null,null,null,null,null,null,null,null,null,null,null,null,null,null,null,1,"0001",0,0,0,1]
[null,null,null,null,"2009/6/4  第2版　姉崎",null,null,null,null,null,null,null,null,null,null,null,null,null,null,null,null,null,null,null,null,null,null,null,null,null,null,null,null,null,null,1,"0001",0,0,0,1]
[null,null,null,null,null,"説明が分かりにくかったので修正(*2)",null,null,null,null,null,null,null,null,null,null,null,null,null,null,null,null,null,null,null,null,null,null,null,null,null,null,null,null,null,1,"0001",0,0,0,1]
[null,null,null,null,"2009/6/4  第2版　姉崎",null,null,null,null,null,null,null,null,null,null,null,null,null,null,null,null,null,null,null,null,null,null,null,null,null,null,null,null,null,null,1,"0001",0,0,0,1]
[null,null,null,null,null,"コンパクトPDF、コンパクトXPSについての説明を追記(*3)",null,null,null,null,null,null,null,null,null,null,null,null,null,null,null,null,null,null,null,null,null,null,null,null,null,null,null,null,null,1,"0001",0,0,0,1]
[null,null,null,null,"2011/6/20　統合仕様書に掲載",null,null,null,null,null,null,null,null,null,null,null,null,null,null,null,null,null,null,null,null,null,null,null,null,null,null,null,null,null,null,1,"0001",0,0,0,1]
[null,null,null,null,null,null,null,null,null,null,null,null,null,null,null,null,null,null,null,null,null,null,null,null,null,null,null,null,null,null,null,null,null,null,"e","e","e","e","e","e","e"]
[]
[]
[]
[]
[]
[]
[]
[]
[]
[]
[]
[]
[]
[]
[]
[]
[]
[]
[]
[]
[]
[]
[]
[]
[]
[]
[]
[]
[]
[]
[]
[]
[]
[]
[]
[]
[]
[]
[]
[]
[]
[]
[]
[]
[]
[]
[]
[]
[]
[]
[]
[]
[]
[]
[]
[]
[]
[]
[]
[]
[]
[]
[]
[]
[]
[]
[]
[]
[]
[]
[]
[]
[]
[]
[]
[]
[]
[]
[]
[]
[]
[]
[]
[]
[]
[]
[]
[]
[]
[]
[]
[]
[]
[]
[]
[]
[]
[]
[]
[]
[]
[]
[]
[]
[]
[]
[]
[]
[]
[]
[]
[]
[]
[]
[]
[]
[]
[]
[]
[]
[]
[]
[]
[]
[]
[]
[]
[]
[]
[]
[]
[]
[]
[]
[]
[]
[]
[]
[]
[]
[]
[]
[]
[]
[]
[]
[]
[]
[]
[]
[]
[]
[]
[]
[]
[]
[]
[]
[]
[]
[]
[]
[]
[]
[]
[]
[]
[]
[]
[]
[]
[]
[]
[]
[]
[]
[]
[]
[]
[]
[]
[]
[]
[]
[]
[]
[]
[]
[]
[]
[]
[]
[]
[]
[]
[]
[]
[]
[]
[]
[]
[]
[]
[]
[]
[]
[]
[]
[]
[]
[]
[]
[]
[]
[]
[]
[]
[]
[]
[]
[]
[]
[]
[]
[]
[]
[]
[]
[]
[]
[]
[]
[]
[]
[]
[]
[]
[]
[]
[]
[]
[]
[]
[]
[]
[]
[]
[]
[]
[]
[]
[]
[]
[]
[]
[]
[]
[]
[]
[]
[]
[]
[]
[]
[]
[]
[]
[]
[]
[]
[]
[]
[]
[]
[]
[]
[]
[]
[]
[]
[]
[]
[]
[]
[]
[]
[]
[]
[]
[]
[]
[]
[]
[]
[]
[]
[]
[]
[]
[]
[]
[]
[]
[]
[]
[]
[]
[]
[]
[]
[]
[]
[]
[]
[]
[]
[]
[]
[]
[]
[]
[]
[]
[]
[]
[]
[]
[]
[]
[]
[]
[]
[]
[]
[]
[]
[]
[]
[]
[]
[]
[]
[]
[]
[]
[]
[]
[]
[]
[]
[]
[]
[]
[]
[]
[]
[]
[]
[]
[]
[]
[]
[]
[]
[]
[]
[]
[]
[]
[]
[]
[]
[]
[]
[]
[]
[]
[]
[]
[]
[]
[]
[]
[]
[]
[]
[]
[]
[]
[]
[]
[]
[]
[]
[]
[]
[]
[]
[]
[]
[]
[]
[]
[]
[]
[]
[]
[]
[]
[]
[]
[]
[]
[]
[]
[]
[]
[]
[]
[]
[]
[]
[]
[]
[]
[]
[]
[]
[]
[]
[]
[]
[]
[]
[]
[]
[]
[]
[]
[]
[]
[]
[]
[]
[]
[]
[]
[]
[]
[]
[]
[]
[]
[]
[]
[]
[]
[]
[]
[]
[]
[]
[]
[]
[]
[]
[]
[]
[]
[]
[]
[]
[]
[]
[]
[]
[]
[]
[]
[]
[]
[]
[]
[]
[]
[]
[]
[]
[]
[]
[]
[]
[]
[]
[]
[]
[]
[]
[]
[]
[]
[]
[]
[]
[]
[]
[]
[]
[]
[]
[]
[]
[]
[]
[]
[]
[]
[]
[]
[]
[]
[]
[]
[]
[]
[]
[]
[]
[]
[]
[]
[]
[]
[]
[]
[]
[]
[]
[]
[]
[]
[]
[]
[]
[]
[]
[]
[]
[]
[]
[]
[]
[]
[]
[]
[]
[]
[]
[]
[]
[]
[]
[]
[]
[]
[]
[]
[]
[]
[]
[]
[]
[]
[]
[]
[]
[]
[]
[]
[]
[]
[]
[]
[]
[]
[]
[]
[]
[]
[]
[]
[]
[]
[]
[]
[]
[]
[]
[]
[]
[]
[]
[]
[]
[]
[]
[]
[]
[]
[]
[]
[]
[]
[]
[]
[]
[]
[]
[]
[]
[]
[]
[]
[]
[]
[]
[]
[]
[]
[]
[]
[]
[]
[]
[]
[]
[]
[]
[]
[]
[]
[]
[]
[]
[]
[]
[]
[]
[]
[]
[]
[]
[]
[]
[]
[]
[]
[]
[]
[]
[]
[]
[]
[]
[]
[]
[]
[]
[]
[]
[]
[]
[]
[]
[]
[]
[]
[]
[]
[]
[]
[]
[]
[]
[]
[]
[]
[]
[]
[]
[]
[]
[]
[]
[]
[]
[]
[]
[]
[]
[]
[]
[]
[]
[]
[]
[]
[]
[]
[]
[]
[]
[]
[]
[]
[]
[]
[]
[]
[]
[]
[]
[]
[]
[]
[]
[]
[]
[]
[]
[]
[]
[]
[]
[]
[]
[]
[]
[]
[]
[]
[]
[]
[]
[]
[]
[]
[]
[]
[]
[]
[]
[]
[]
[]
[]
[]
[]
[]
[]
[]
[]
[]
[]
[]
[]
[]
[]
[]
[]
[]
[]
[]
[]
[]
[]
[]
[]
[]
[]
[]
[]
[]
[]
[]
[]
[]
[]
[]
[]
[]
[]
[]
[]
[]
[]
[]
[]
[]
[]
[]
[]
[]
[]
[]
[]
[]
[]
[]
[]
[]
[]
[]
[]
[]
[]
[]
[]
[]
[]
[]
[]
[]
[]
[]
[]
[]
[]
[]
[]
[]
[]
[]
[]
[]
[]
[]
[]
[]
[]
[]
[]
[]
[]
[]
[]
[]
[]
[]
[]
[]
[]
[]
[]
[]
[]
[]
[]
[]
[]
[]
[]
[]
[]
[]
[]
[]
[]
[]
[]
[]
[]
[]
[]
[]
[]
[]
[]
[]
[]
[]
[]
[]
[]
[]
[]
[]
[]
[]
[]
[]
[]
[]
[]
[]
[]
[]
[]
[]
[]
[]
[]
[]
[]
[]
[]
[]
[]
[]
[]
[]
[]
[]
[]
[]
[]
[]
[]
[]
[]
[]
[]
[]
[]
[]
[]
[]
[]
[]
[]
[]
[]
[]
[]
[]
[]
[]
[]
[]
[]
[]
[]
[]
[]
[]
[]
[]
[]
[]
[]
[]
[null,null,null,null,null,null,null,null,null,null,null,null,null,null,null,null,null,null,null,null,null,null,null,null,null,null,null,null,null,null,null,null,null,null,0]
[null,null,null,null,null,null,null,null,null,null,null,null,null,null,null,null,null,null,null,null,null,null,null,null,null,null,null,null,null,null,null,null,null,null,0]
[null,null,null,null,null,null,null,null,null,null,null,null,null,null,null,null,null,null,null,null,null,null,null,null,null,null,null,null,null,null,null,null,null,null,0]
[null,null,null,null,null,null,null,null,null,null,null,null,null,null,null,null,null,null,null,null,null,null,null,null,null,null,null,null,null,null,null,null,null,null,0]
[null,null,null,null,null,null,null,null,null,null,null,null,null,null,null,null,null,null,null,null,null,null,null,null,null,null,null,null,null,null,null,null,null,null,0]
[null,null,null,null,null,null,null,null,null,null,null,null,null,null,null,null,null,null,null,null,null,null,null,null,null,null,null,null,null,null,null,null,null,null,0]
[null,null,null,null,null,null,null,null,null,null,null,null,null,null,null,null,null,null,null,null,null,null,null,null,null,null,null,null,null,null,null,null,null,null,0]
[null,null,null,null,null,null,null,null,null,null,null,null,null,null,null,null,null,null,null,null,null,null,null,null,null,null,null,null,null,null,null,null,null,null,0]
[null,null,null,null,null,null,null,null,null,null,null,null,null,null,null,null,null,null,null,null,null,null,null,null,null,null,null,null,null,null,null,null,null,null,0]
[null,null,null,null,null,null,null,null,null,null,null,null,null,null,null,null,null,null,null,null,null,null,null,null,null,null,null,null,null,null,null,null,null,null,0]
[null,null,null,null,null,null,null,null,null,null,null,null,null,null,null,null,null,null,null,null,null,null,null,null,null,null,null,null,null,null,null,null,null,null,0]
[null,null,null,null,null,null,null,null,null,null,null,null,null,null,null,null,null,null,null,null,null,null,null,null,null,null,null,null,null,null,null,null,null,null,0]
[null,null,null,null,null,null,null,null,null,null,null,null,null,null,null,null,null,null,null,null,null,null,null,null,null,null,null,null,null,null,null,null,null,null,0]
[null,null,null,null,null,null,null,null,null,null,null,null,null,null,null,null,null,null,null,null,null,null,null,null,null,null,null,null,null,null,null,null,null,null,0]
[null,null,null,null,null,null,null,null,null,null,null,null,null,null,null,null,null,null,null,null,null,null,null,null,null,null,null,null,null,null,null,null,null,null,0]
[null,null,null,null,null,null,null,null,null,null,null,null,null,null,null,null,null,null,null,null,null,null,null,null,null,null,null,null,null,null,null,null,null,null,0]
[null,null,null,null,null,null,null,null,null,null,null,null,null,null,null,null,null,null,null,null,null,null,null,null,null,null,null,null,null,null,null,null,null,null,0]
[null,null,null,null,null,null,null,null,null,null,null,null,null,null,null,null,null,null,null,null,null,null,null,null,null,null,null,null,null,null,null,null,null,null,0]
[null,null,null,null,null,null,null,null,null,null,null,null,null,null,null,null,null,null,null,null,null,null,null,null,null,null,null,null,null,null,null,null,null,null,0]
[null,null,null,null,null,null,null,null,null,null,null,null,null,null,null,null,null,null,null,null,null,null,null,null,null,null,null,null,null,null,null,null,null,null,0]
[null,null,null,null,null,null,null,null,null,null,null,null,null,null,null,null,null,null,null,null,null,null,null,null,null,null,null,null,null,null,null,null,null,null,0]
[null,null,null,null,null,null,null,null,null,null,null,null,null,null,null,null,null,null,null,null,null,null,null,null,null,null,null,null,null,null,null,null,null,null,0]
[null,null,null,null,null,null,null,null,null,null,null,null,null,null,null,null,null,null,null,null,null,null,null,null,null,null,null,null,null,null,null,null,null,null,0]
[null,null,null,null,null,null,null,null,null,null,null,null,null,null,null,null,null,null,null,null,null,null,null,null,null,null,null,null,null,null,null,null,null,null,0]
[null,null,null,null,null,null,null,null,null,null,null,null,null,null,null,null,null,null,null,null,null,null,null,null,null,null,null,null,null,null,null,null,null,null,0]
[null,null,null,null,null,null,null,null,null,null,null,null,null,null,null,null,null,null,null,null,null,null,null,null,null,null,null,null,null,null,null,null,null,null,0]
[null,null,null,null,null,null,null,null,null,null,null,null,null,null,null,null,null,null,null,null,null,null,null,null,null,null,null,null,null,null,null,null,null,null,0]
[null,null,null,null,null,null,null,null,null,null,null,null,null,null,null,null,null,null,null,null,null,null,null,null,null,null,null,null,null,null,null,null,null,null,0]
[null,null,null,null,null,null,null,null,null,null,null,null,null,null,null,null,null,null,null,null,null,null,null,null,null,null,null,null,null,null,null,null,null,null,0]
[null,null,null,null,null,null,null,null,null,null,null,null,null,null,null,null,null,null,null,null,null,null,null,null,null,null,null,null,null,null,null,null,null,null,0]
[null,null,null,null,null,null,null,null,null,null,null,null,null,null,null,null,null,null,null,null,null,null,null,null,null,null,null,null,null,null,null,null,null,null,0]
[null,null,null,null,null,null,null,null,null,null,null,null,null,null,null,null,null,null,null,null,null,null,null,null,null,null,null,null,null,null,null,null,null,null,0]
[null,null,null,null,null,null,null,null,null,null,null,null,null,null,null,null,null,null,null,null,null,null,null,null,null,null,null,null,null,null,null,null,null,null,0]
[null,null,null,null,null,null,null,null,null,null,null,null,null,null,null,null,null,null,null,null,null,null,null,null,null,null,null,null,null,null,null,null,null,null,0]

{"sheet":"（参考）中国語の並び替え","index":6,"n_rows":1023,"n_cols":38,"rows_kept":1023,"cut":false,"hidden":false,"merged":[[21,2,21,7],[34,2,34,7],[21,32,21,37],[34,32,34,37]]}
[null,null,null,null,null,null,null,null,null,null,null,null,null,null,null,null,null,null,null,null,null,null,null,"SP","F","BIN",4,3,2,1]
[null,"本資料は仕様検討時の参考資料である",null,null,null,null,null,null,null,null,null,null,null,null,null,null,null,null,null,null,null,null,null,null,1,{"$f":"IF(Y2=\"\",\"\",DEC2BIN(Y2,4))","v":"0001"},{"$f":"IF($Z2=\"\",\"\",VALUE(MID($Z2,1,1)))","v":0},{"$f":"IF($Z2=\"\",\"\",VALUE(MID($Z2,2,1)))","v":0},{"$f":"IF($Z2=\"\",\"\",VALUE(MID($Z2,3,1)))","v":0},{"$f":"IF($Z2=\"\",\"\",VALUE(MID($Z2,4,1)))","v":1}]
[null,null,null,null,null,null,null,null,null,null,null,null,null,null,null,null,null,null,null,null,null,null,null,null,null,{"$f":"IF(Y3=\"\",\"\",DEC2BIN(Y3,4))","v":""},{"$f":"IF($Z3=\"\",\"\",VALUE(MID($Z3,1,1)))","v":""},{"$f":"IF($Z3=\"\",\"\",VALUE(MID($Z3,2,1)))","v":""},{"$f":"IF($Z3=\"\",\"\",VALUE(MID($Z3,3,1)))","v":""},{"$f":"IF($Z3=\"\",\"\",VALUE(MID($Z3,4,1)))","v":""}]
[null,"＜中国語の並び替え規則＞",null,null,null,null,null,null,null,null,null,null,null,null,null,null,null,null,null,null,null,null,null,null,1,"0001",0,0,0,1]
[null,"中国語の並び替えは、ピンインのアルファベット順ではなく、漢字ごとのピンイン順で並び替える",null,null,null,null,null,null,null,null,null,null,null,null,null,null,null,null,null,null,null,null,null,null,1,"0001",0,0,0,1]
[null,"漢字ごとのピンインは、以下の規則で区切る",null,null,null,null,null,null,null,null,null,null,null,null,null,null,null,null,null,null,null,null,null,null,1,"0001",0,0,0,1]
[null,"１．子音の前で区切る",null,null,null,null,null,null,null,null,null,null,null,null,null,null,null,null,null,null,null,null,null,null,1,"0001",0,0,0,1]
[null,"　注）鼻母音は、１つの塊として扱うので、子音前で区切らないこと",null,null,null,null,null,null,null,null,null,null,null,null,null,null,null,null,null,null,null,null,null,null,1,"0001",0,0,0,1]
[null,"２．鼻母音の後で区切る",null,null,null,null,null,null,null,null,null,null,null,null,null,null,null,null,null,null,null,null,null,null,1,"0001",0,0,0,1]
[null,"　注）ianというピンインの場合、ia（鼻母音）とn（子音）、またはian(鼻母音）の２つの区切り方が考えられるが、この場合は１つの塊でian(鼻母音)として処理する",null,null,null,null,null,null,null,null,null,null,null,null,null,null,null,null,null,null,null,null,null,null,1,"0001",0,0,0,1]
[null,"　     同様にiangというピンインの場合は、ian（鼻母音）とg（子音）、またはiang(鼻母音）の２つの区切り方が考えられるが、この場合も１つの塊でiang(鼻母音)として処理する",null,null,null,null,null,null,null,null,null,null,null,null,null,null,null,null,null,null,null,null,null,null,1,"0001",0,0,0,1]
[null,"３．アポストロフィ（’）で区切る",null,null,null,null,null,null,null,null,null,null,null,null,null,null,null,null,null,null,null,null,null,null,1,"0001",0,0,0,1]
[null,null,null,null,null,null,null,null,null,null,null,null,null,null,null,null,null,null,null,null,null,null,null,null,null,"","","","",""]
[null,"子音　b, c, d, f, g, h, j, k, l, m, n, p, q, r, s, t, x, z, ch, sh, zh、y(※)、w(※)",null,null,null,null,null,null,null,null,null,null,null,null,null,null,null,null,null,null,null,null,null,null,1,"0001",0,0,0,1]
[null,"　※双韻母、複韻母で、前に子音が付かない場合、i、u、üがy、wに変化する為、yとwは子音として判断する",null,null,null,null,null,null,null,null,null,null,null,null,null,null,null,null,null,null,null,null,null,null,1,"0001",0,0,0,1]
[null,"母音　a, o, e, i, u, ü",null,null,null,null,null,null,null,null,null,null,null,null,null,null,null,null,null,null,null,null,null,null,1,"0001",0,0,0,1]
[null,"鼻母音 an, en, in, ian, uan, uen, üan, ün, ang, ong, eng, ing, iang, iong, uang, ueng",null,null,null,null,null,null,null,null,null,null,null,null,null,null,null,null,null,null,null,null,null,null,1,"0001",0,0,0,1]
[null,"※ü は v で入力される。",null,null,null,null,null,null,null,null,null,null,null,null,null,null,null,null,null,null,null,null,null,null,1,"0001",0,0,0,1]
[null,null,null,null,null,null,null,null,null,null,null,null,null,null,null,null,null,null,null,null,null,null,null,null,null,"","","","",""]
[null,"＜中国語の並び替え例＞",null,null,null,null,null,null,null,null,null,null,null,null,null,null,null,null,null,null,null,null,null,null,1,"0001",0,0,0,1]
[null,"登録名が以下の場合のソート順",null,null,null,null,null,null,null,null,null,null,null,null,null,null,null,null,null,null,null,null,null,null,1,"0001",0,0,0,1]
[null,"並び順","登録名",null,null,null,null,null,null,null,null,null,null,null,null,null,null,null,null,null,null,null,null,null,1,"0001",0,0,0,1]
[null,1,"p","i","'","a","o",null,null,"piの後ろでアポストロフィ（’）で区切られているので、piで１つの漢字なので、最初になる。",null,null,null,null,null,null,null,null,null,null,null,null,null,null,1,"0001",0,0,0,1,null,1,"p","i","'","a","o"]
[null,2,"p","i","h","a","o",null,null,"子音(h)の前で区切られるので、３．と同じ漢字を表している。この場合は、第２キー（登録種別）、第３キー（登録No.）でソートする",null,null,null,null,null,null,null,null,null,null,null,null,null,null,1,"0001",0,0,0,1,null,2,"p","i","h","a","o"]
[null,3,"p","i","'","h","a","o",null,"アポストロフィ（’）で区切られるので、２．と同じ漢字を表している。この場合は、第２キー（登録種別）、第３キー（登録No.）でソートする",null,null,null,null,null,null,null,null,null,null,null,null,null,null,1,"0001",0,0,0,1,null,3,"p","i","'","h","a","o"]
[null,4,"p","i","a","o",null,null,null,"文字列としては１．と同じだが、１．は最初の２文字で１つの漢字を表し、４．は４文字で１つの漢字を表すので、並びとしては最後になる。",null,null,null,null,null,null,null,null,null,null,null,null,null,null,1,"0001",0,0,0,1,null,4,"p","i","a","o"]
[null,null,null,null,null,null,null,null,null,null,null,null,null,null,null,null,null,null,null,null,null,null,null,null,null,"","","","",""]
[null,"上記の並びに、piaaを追加する場合は、以下のようになる。",null,null,null,null,null,null,null,null,null,null,null,null,null,null,null,null,null,null,null,null,null,null,1,"0001",0,0,0,1]
[null,"①","１番目のpi'aoと、追加するpiaaを比較する",null,null,null,null,null,"→","区切り単位で比較するので、piとpiaaの比較となり、piaaの方が並び順が後になる",null,null,null,null,null,null,null,null,null,null,null,null,null,null,1,"0001",0,0,0,1]
[null,"②","２番目のpihaoと、追加するpiaaを比較する",null,null,null,null,null,"→",null,null,null,"〃",null,null,null,null,null,null,null,null,null,null,null,1,"0001",0,0,0,1]
[null,"③","３番目のpi'haoと、追加するpiaaを比較する",null,null,null,null,null,"→",null,null,null,"〃",null,null,null,null,null,null,null,null,null,null,null,1,"0001",0,0,0,1]
[null,"④","４番目のpiaoと、追加するpiaaを比較する",null,null,null,null,null,"→","区切りが無いので、piaoとpiaaの比較となり、piaaの方が並び順が先になる",null,null,null,null,null,null,null,null,null,null,null,null,null,null,1,"0001",0,0,0,1]
[null,null,null,null,null,null,null,null,null,null,null,null,null,null,null,null,null,null,null,null,null,null,null,null,null,"","","","",""]
[null,"従って、piaaは、４番目に追加される",null,null,null,null,null,null,null,null,null,null,null,null,null,null,null,null,null,null,null,null,null,null,1,"0001",0,0,0,1]
[null,"並び順","登録名",null,null,null,null,null,null,null,null,null,null,null,null,null,null,null,null,null,null,null,null,null,null,"","","","","",null,"並び順","登録名"]
[null,1,"p","i","'","a","o",null,null,null,null,null,null,null,null,null,null,null,null,null,null,null,null,null,null,"","","","","",null,1,"p","i","'","a","o"]
[null,2,"p","i","h","a","o",null,null,null,null,null,null,null,null,null,null,null,null,null,null,null,null,null,null,"","","","","",null,2,"p","i","h","a","o"]
[null,3,"p","i","'","h","a","o",null,null,null,null,null,null,null,null,null,null,null,null,null,null,null,null,null,"","","","","",null,3,"p","i","'","h","a","o"]
[null,4,"p","i","a","a",null,null,null,null,null,null,null,null,null,null,null,null,null,null,null,null,null,null,null,"","","","","",null,4,"p","i","a","a"]
[null,5,"p","i","a","o",null,null,null,null,null,null,null,null,null,null,null,null,null,null,null,null,null,null,null,"","","","","",null,5,"p","i","a","o"]
[null,null,null,null,null,null,null,null,null,null,null,null,null,null,null,null,null,null,null,null,null,null,null,"e","e","e","e","e","ee","e"]
[]
[]
[]
[]
[]
[]
[]
[]
[]
[]
[]
[]
[]
[]
[]
[]
[]
[]
[]
[]
[]
[]
[]
[]
[]
[]
[]
[]
[]
[]
[]
[]
[]
[]
[]
[]
[]
[]
[]
[]
[]
[]
[]
[]
[]
[]
[]
[]
[]
[]
[]
[]
[]
[]
[]
[]
[]
[]
[]
[]
[]
[]
[]
[]
[]
[]
[]
[]
[]
[]
[]
[]
[]
[]
[]
[]
[]
[]
[]
[]
[]
[]
[]
[]
[]
[]
[]
[]
[]
[]
[]
[]
[]
[]
[]
[]
[]
[]
[]
[]
[]
[]
[]
[]
[]
[]
[]
[]
[]
[]
[]
[]
[]
[]
[]
[]
[]
[]
[]
[]
[]
[]
[]
[]
[]
[]
[]
[]
[]
[]
[]
[]
[]
[]
[]
[]
[]
[]
[]
[]
[]
[]
[]
[]
[]
[]
[]
[]
[]
[]
[]
[]
[]
[]
[]
[]
[]
[]
[]
[]
[]
[]
[]
[]
[]
[]
[]
[]
[]
[]
[]
[]
[]
[]
[]
[]
[]
[]
[]
[]
[]
[]
[]
[]
[]
[]
[]
[]
[]
[]
[]
[]
[]
[]
[]
[]
[]
[]
[]
[]
[]
[]
[]
[]
[]
[]
[]
[]
[]
[]
[]
[]
[]
[]
[]
[]
[]
[]
[]
[]
[]
[]
[]
[]
[]
[]
[]
[]
[]
[]
[]
[]
[]
[]
[]
[]
[]
[]
[]
[]
[]
[]
[]
[]
[]
[]
[]
[]
[]
[]
[]
[]
[]
[]
[]
[]
[]
[]
[]
[]
[]
[]
[]
[]
[]
[]
[]
[]
[]
[]
[]
[]
[]
[]
[]
[]
[]
[]
[]
[]
[]
[]
[]
[]
[]
[]
[]
[]
[]
[]
[]
[]
[]
[]
[]
[]
[]
[]
[]
[]
[]
[]
[]
[]
[]
[]
[]
[]
[]
[]
[]
[]
[]
[]
[]
[]
[]
[]
[]
[]
[]
[]
[]
[]
[]
[]
[]
[]
[]
[]
[]
[]
[]
[]
[]
[]
[]
[]
[]
[]
[]
[]
[]
[]
[]
[]
[]
[]
[]
[]
[]
[]
[]
[]
[]
[]
[]
[]
[]
[]
[]
[]
[]
[]
[]
[]
[]
[]
[]
[]
[]
[]
[]
[]
[]
[]
[]
[]
[]
[]
[]
[]
[]
[]
[]
[]
[]
[]
[]
[]
[]
[]
[]
[]
[]
[]
[]
[]
[]
[]
[]
[]
[]
[]
[]
[]
[]
[]
[]
[]
[]
[]
[]
[]
[]
[]
[]
[]
[]
[]
[]
[]
[]
[]
[]
[]
[]
[]
[]
[]
[]
[]
[]
[]
[]
[]
[]
[]
[]
[]
[]
[]
[]
[]
[]
[]
[]
[]
[]
[]
[]
[]
[]
[]
[]
[]
[]
[]
[]
[]
[]
[]
[]
[]
[]
[]
[]
[]
[]
[]
[]
[]
[]
[]
[]
[]
[]
[]
[]
[]
[]
[]
[]
[]
[]
[]
[]
[]
[]
[]
[]
[]
[]
[]
[]
[]
[]
[]
[]
[]
[]
[]
[]
[]
[]
[]
[]
[]
[]
[]
[]
[]
[]
[]
[]
[]
[]
[]
[]
[]
[]
[]
[]
[]
[]
[]
[]
[]
[]
[]
[]
[]
[]
[]
[]
[]
[]
[]
[]
[]
[]
[]
[]
[]
[]
[]
[]
[]
[]
[]
[]
[]
[]
[]
[]
[]
[]
[]
[]
[]
[]
[]
[]
[]
[]
[]
[]
[]
[]
[]
[]
[]
[]
[]
[]
[]
[]
[]
[]
[]
[]
[]
[]
[]
[]
[]
[]
[]
[]
[]
[]
[]
[]
[]
[]
[]
[]
[]
[]
[]
[]
[]
[]
[]
[]
[]
[]
[]
[]
[]
[]
[]
[]
[]
[]
[]
[]
[]
[]
[]
[]
[]
[]
[]
[]
[]
[]
[]
[]
[]
[]
[]
[]
[]
[]
[]
[]
[]
[]
[]
[]
[]
[]
[]
[]
[]
[]
[]
[]
[]
[]
[]
[]
[]
[]
[]
[]
[]
[]
[]
[]
[]
[]
[]
[]
[]
[]
[]
[]
[]
[]
[]
[]
[]
[]
[]
[]
[]
[]
[]
[]
[]
[]
[]
[]
[]
[]
[]
[]
[]
[]
[]
[]
[]
[]
[]
[]
[]
[]
[]
[]
[]
[]
[]
[]
[]
[]
[]
[]
[]
[]
[]
[]
[]
[]
[]
[]
[]
[]
[]
[]
[]
[]
[]
[]
[]
[]
[]
[]
[]
[]
[]
[]
[]
[]
[]
[]
[]
[]
[]
[]
[]
[]
[]
[]
[]
[]
[]
[]
[]
[]
[]
[]
[]
[]
[]
[]
[]
[]
[]
[]
[]
[]
[]
[]
[]
[]
[]
[]
[]
[]
[]
[]
[]
[]
[]
[]
[]
[]
[]
[]
[]
[]
[]
[]
[]
[]
[]
[]
[]
[]
[]
[]
[]
[]
[]
[]
[]
[]
[]
[]
[]
[]
[]
[]
[]
[]
[]
[]
[]
[]
[]
[]
[]
[]
[]
[]
[]
[]
[]
[]
[]
[]
[]
[]
[]
[]
[]
[]
[]
[]
[]
[]
[]
[]
[]
[]
[]
[]
[]
[]
[]
[]
[]
[]
[]
[]
[]
[]
[]
[]
[]
[]
[]
[]
[]
[]
[]
[]
[]
[]
[]
[]
[]
[]
[]
[]
[]
[]
[]
[]
[]
[]
[]
[]
[]
[]
[]
[]
[]
[]
[]
[]
[]
[]
[]
[]
[]
[]
[]
[]
[]
[]
[]
[]
[]
[]
[]
[]
[]
[]
[]
[]
[]
[]
[]
[]
[]
[]
[]
[]
[]
[]
[]
[]
[]
[]
[]
[]
[]
[]
[]
[]
[]
[]
[]
[]
[]
[]
[]
[]
[]
[]
[]
[]
[]
[]
[]
[]
[]
[]
[]
[]
[]
[]
[]
[]
[]
[]
[]
[]
[]
[]
[]
[]
[]
[]
[]
[]
[null,null,null,null,null,null,null,null,null,null,null,null,null,null,null,null,null,null,null,null,null,null,null,0]
[null,null,null,null,null,null,null,null,null,null,null,null,null,null,null,null,null,null,null,null,null,null,null,0]
[null,null,null,null,null,null,null,null,null,null,null,null,null,null,null,null,null,null,null,null,null,null,null,0]
[null,null,null,null,null,null,null,null,null,null,null,null,null,null,null,null,null,null,null,null,null,null,null,0]
[null,null,null,null,null,null,null,null,null,null,null,null,null,null,null,null,null,null,null,null,null,null,null,0]
[null,null,null,null,null,null,null,null,null,null,null,null,null,null,null,null,null,null,null,null,null,null,null,0]
[null,null,null,null,null,null,null,null,null,null,null,null,null,null,null,null,null,null,null,null,null,null,null,0]
[null,null,null,null,null,null,null,null,null,null,null,null,null,null,null,null,null,null,null,null,null,null,null,0]
[null,null,null,null,null,null,null,null,null,null,null,null,null,null,null,null,null,null,null,null,null,null,null,0]
[null,null,null,null,null,null,null,null,null,null,null,null,null,null,null,null,null,null,null,null,null,null,null,0]
[null,null,null,null,null,null,null,null,null,null,null,null,null,null,null,null,null,null,null,null,null,null,null,0]
[null,null,null,null,null,null,null,null,null,null,null,null,null,null,null,null,null,null,null,null,null,null,null,0]
[null,null,null,null,null,null,null,null,null,null,null,null,null,null,null,null,null,null,null,null,null,null,null,0]
[null,null,null,null,null,null,null,null,null,null,null,null,null,null,null,null,null,null,null,null,null,null,null,0]
[null,null,null,null,null,null,null,null,null,null,null,null,null,null,null,null,null,null,null,null,null,null,null,0]
[null,null,null,null,null,null,null,null,null,null,null,null,null,null,null,null,null,null,null,null,null,null,null,0]
[null,null,null,null,null,null,null,null,null,null,null,null,null,null,null,null,null,null,null,null,null,null,null,0]
[null,null,null,null,null,null,null,null,null,null,null,null,null,null,null,null,null,null,null,null,null,null,null,0]
[null,null,null,null,null,null,null,null,null,null,null,null,null,null,null,null,null,null,null,null,null,null,null,0]
[null,null,null,null,null,null,null,null,null,null,null,null,null,null,null,null,null,null,null,null,null,null,null,0]
[null,null,null,null,null,null,null,null,null,null,null,null,null,null,null,null,null,null,null,null,null,null,null,0]
[null,null,null,null,null,null,null,null,null,null,null,null,null,null,null,null,null,null,null,null,null,null,null,0]
[null,null,null,null,null,null,null,null,null,null,null,null,null,null,null,null,null,null,null,null,null,null,null,0]

{"sheet":"(参考）OOXML出力形式 ","index":7,"n_rows":1015,"n_cols":22,"rows_kept":1015,"cut":false,"hidden":false,"merged":[[436,2,439,9],[429,2,433,2],[429,3,429,4],[429,5,429,9],[430,3,430,4],[430,5,430,9],[431,3,431,4],[431,5,431,9],[432,3,432,4],[432,5,432,9],[433,3,433,4],[433,5,433,9],[422,3,422,4],[422,5,422,9],[423,2,428,2],[423,3,423,4],[423,5,423,9],[424,3,424,4],[424,5,424,9],[425,3,425,4],[425,5,425,9],[426,3,426,4],[426,5,426,9],[427,3,427,4],[427,5,427,9],[428,3,428,4],[428,5,428,9],[422,25,422,26],[422,27,422,31],[423,24,428,24],[423,25,423,26],[423,27,423,31],[424,25,424,26],[424,27,424,31],[425,25,425,26],[425,27,425,31],[426,25,426,26],[426,27,426,31],[427,25,427,26],[427,27,427,31],[428,25,428,26],[428,27,428,31],[436,24,439,31],[429,24,433,24],[429,25,429,26],[429,27,429,31],[430,25,430,26],[430,27,430,31],[431,25,431,26],[431,27,431,31],[432,25,432,26],[432,27,432,31],[433,25,433,26],[433,27,433,31]]}
[null,null,null,null,null,null,null,null,null,null,null,null,null,null,null,"SP","F","BIN",4,3,2,1]
["(参考）OOXML出力形式 ",null,null,null,null,null,null,null,null,null,null,null,null,null,null,null,1,{"$f":"IF(Q2=\"\",\"\",DEC2BIN(Q2,4))","v":"0001"},{"$f":"IF($R2=\"\",\"\",VALUE(MID($R2,1,1)))","v":0},{"$f":"IF($R2=\"\",\"\",VALUE(MID($R2,2,1)))","v":0},{"$f":"IF($R2=\"\",\"\",VALUE(MID($R2,3,1)))","v":0},{"$f":"IF($R2=\"\",\"\",VALUE(MID($R2,4,1)))","v":1}]
[null,null,null,null,null,null,null,null,null,null,null,null,null,null,null,null,null,{"$f":"IF(Q3=\"\",\"\",DEC2BIN(Q3,4))","v":""},{"$f":"IF($R3=\"\",\"\",VALUE(MID($R3,1,1)))","v":""},{"$f":"IF($R3=\"\",\"\",VALUE(MID($R3,2,1)))","v":""},{"$f":"IF($R3=\"\",\"\",VALUE(MID($R3,3,1)))","v":""},{"$f":"IF($R3=\"\",\"\",VALUE(MID($R3,4,1)))","v":""}]
["１．Power Point　の出力形式 ",null,null,null,null,null,null,null,null,null,null,null,null,null,null,null,1,"0001",0,0,0,1]
[null,null,null,null,null,null,null,null,null,null,null,null,null,null,null,null,null,"","","","",""]
[null,"◆出力形式：画像優先",null,null,null,null,null,null,null,null,null,null,null,null,null,null,1,"0001",0,0,0,1]
[null,null,null,null,null,null,null,null,null,null,null,null,null,null,null,null,null,"","","","",""]
[null,null,null,null,null,null,null,null,null,null,null,null,null,null,null,null,null,"","","","",""]
[null,null,null,null,null,null,null,null,null,null,null,null,null,null,null,null,null,"","","","",""]
[null,null,null,null,null,null,null,null,null,null,null,null,null,null,null,null,null,"","","","",""]
[null,null,null,null,null,null,null,null,null,null,null,null,null,null,null,null,null,"","","","",""]
[null,null,null,null,null,null,null,null,null,null,null,null,null,null,null,null,null,"","","","",""]
[null,null,null,null,null,null,null,null,null,null,null,null,null,null,null,null,null,"","","","",""]
[null,null,null,null,null,null,null,null,null,null,null,null,null,null,null,null,null,"","","","",""]
[null,null,null,null,null,null,null,null,null,null,null,null,null,null,null,null,null,"","","","",""]
[null,null,null,null,null,null,null,null,null,null,null,null,null,null,null,null,null,"","","","",""]
[null,null,null,null,null,null,null,null,null,null,null,null,null,null,null,null,null,"","","","",""]
[null,null,null,null,null,null,null,null,null,null,null,null,null,null,null,null,null,"","","","",""]
[null,null,null,null,null,null,null,null,null,null,null,null,null,null,null,null,null,"","","","",""]
[null,null,null,null,null,null,null,null,null,null,null,null,null,null,null,null,null,"","","","",""]
[null,null,null,null,null,null,null,null,null,null,null,null,null,null,null,null,null,"","","","",""]
[null,null,null,null,null,null,null,null,null,null,null,null,null,null,null,null,null,"","","","",""]
[null,null,null,null,null,null,null,null,null,null,null,null,null,null,null,null,null,"","","","",""]
[null,null,null,null,null,null,null,null,null,null,null,null,null,null,null,null,null,"","","","",""]
[null,null,null,null,null,null,null,null,null,null,null,null,null,null,null,null,null,"","","","",""]
[null,null,null,null,null,null,null,null,null,null,null,null,null,null,null,null,null,"","","","",""]
[null,null,null,null,null,null,"図１　レイヤ構造",null,null,null,null,null,null,null,null,null,1,"0001",0,0,0,1]
[null,null,null,null,null,null,null,null,null,null,null,null,null,null,null,null,null,"","","","",""]
[null,null,null,null,null,null,null,null,null,null,null,null,null,null,null,null,null,"","","","",""]
[null,"◆出力形式：画像のみ",null,null,null,null,null,null,null,null,null,null,null,null,null,null,1,"0001",0,0,0,1]
[null,null,null,null,null,null,null,null,null,null,null,null,null,null,null,null,null,"","","","",""]
[null,null,null,null,null,null,null,null,null,null,null,null,null,null,null,null,null,"","","","",""]
[null,null,null,null,null,null,null,null,null,null,null,null,null,null,null,null,null,"","","","",""]
[null,null,null,null,null,null,null,null,null,null,null,null,null,null,null,null,null,"","","","",""]
[null,null,null,null,null,null,null,null,null,null,null,null,null,null,null,null,null,"","","","",""]
[null,null,null,null,null,null,null,null,null,null,null,null,null,null,null,null,null,"","","","",""]
[null,null,null,null,null,null,null,null,null,null,null,null,null,null,null,null,null,"","","","",""]
[null,null,null,null,null,null,null,null,null,null,null,null,null,null,null,null,null,"","","","",""]
[null,null,null,null,null,null,null,null,null,null,null,null,null,null,null,null,null,"","","","",""]
[null,null,null,null,null,null,null,null,null,null,null,null,null,null,null,null,null,"","","","",""]
[null,null,null,null,null,null,null,null,null,null,null,null,null,null,null,null,null,"","","","",""]
[null,null,null,null,null,null,null,null,null,null,null,null,null,null,null,null,null,"","","","",""]
[null,null,null,null,null,null,null,null,null,null,null,null,null,null,null,null,null,"","","","",""]
[null,null,null,null,null,null,null,null,null,null,null,null,null,null,null,null,null,"","","","",""]
[null,null,null,null,null,null,null,null,null,null,null,null,null,null,null,null,null,"","","","",""]
[null,null,null,null,null,null,null,null,null,null,null,null,null,null,null,null,null,"","","","",""]
[null,null,null,null,null,null,null,null,null,null,null,null,null,null,null,null,null,"","","","",""]
[null,null,null,null,null,null,"図２　レイヤ構造",null,null,null,null,null,null,null,null,null,1,"0001",0,0,0,1]
[null,null,null,null,null,null,null,null,null,null,null,null,null,null,null,null,null,"","","","",""]
[null,null,null,null,null,null,null,null,null,null,null,null,null,null,null,null,null,"","","","",""]
[null,null,null,null,null,null,null,null,null,null,null,null,null,null,null,null,null,"","","","",""]
[null,null,null,null,null,null,null,null,null,null,null,null,null,null,null,null,null,"","","","",""]
[null,null,null,null,null,null,null,null,null,null,null,null,null,null,null,null,null,"","","","",""]
[null,null,null,null,null,null,null,null,null,null,null,null,null,null,null,null,null,"","","","",""]
[null,null,null,null,null,null,null,null,null,null,null,null,null,null,null,null,null,"","","","",""]
[null,null,null,null,null,null,null,null,null,null,null,null,null,null,null,null,null,"","","","",""]
[null,null,null,null,null,null,null,null,null,null,null,null,null,null,null,null,null,"","","","",""]
[null,null,null,null,null,null,null,null,null,null,null,null,null,null,null,null,null,"","","","",""]
[null,null,null,null,null,null,null,null,null,null,null,null,null,null,null,null,null,"","","","",""]
["２．OOXML Word　の出力形式 ",null,null,null,null,null,null,null,null,null,null,null,null,null,null,null,1,"0001",0,0,0,1]
[null,null,null,null,null,null,null,null,null,null,null,null,null,null,null,null,null,"","","","",""]
[null,"◆出力形式：画像と文字",null,null,null,null,null,null,null,null,null,null,null,null,null,null,1,"0001",0,0,0,1]
[null,null,null,null,null,null,null,null,null,null,null,null,null,null,null,null,null,"","","","",""]
[null,null,"（１）OCRの結果、座標位置が近いテキスト同士は結合して一つのテキストボックスとする",null,null,null,null,null,null,null,null,null,null,null,null,null,1,"0001",0,0,0,1]
[null,null,"※横書きであれば上側文字の左下座標と他のテキストの左上座標、",null,null,null,null,null,null,null,null,null,null,null,null,null,1,"0001",0,0,0,1]
[null,null,"　 縦書きであれば右側文字の左上座標と他のテキストの右上座標の距離に応じてボックスを結合する。",null,null,null,null,null,null,null,null,null,null,null,null,null,1,"0001",0,0,0,1]
[null,null,"（２）結合されても結合前のそれぞれのフォントサイズは維持する",null,null,null,null,null,null,null,null,null,null,null,null,null,1,{"$f":"IF(Q67=\"\",\"\",DEC2BIN(Q67,4))","v":"0001"},{"$f":"IF($R67=\"\",\"\",VALUE(MID($R67,1,1)))","v":0},{"$f":"IF($R67=\"\",\"\",VALUE(MID($R67,2,1)))","v":0},{"$f":"IF($R67=\"\",\"\",VALUE(MID($R67,3,1)))","v":0},{"$f":"IF($R67=\"\",\"\",VALUE(MID($R67,4,1)))","v":1}]
[null,null,"（３）結合されたテキストボックスのサイズは、全てのテキストボックスを内包する矩形サイズとする",null,null,null,null,null,null,null,null,null,null,null,null,null,1,"0001",0,0,0,1]
[null,null,"（４）下記算術方法にて行間距離を決定する",null,null,null,null,null,null,null,null,null,null,null,null,null,1,"0001",0,0,0,1]
[null,null,"※横書き：（上述のテキストボックスの縦サイズ - 結合された全テキストボックス高さの合計）/ （結合文字行数－１）",null,null,null,null,null,null,null,null,null,null,null,null,null,1,"0001",0,0,0,1]
[null,null,"　 縦書き：（上述のテキストボックスの横サイズ - 結合された全テキストボックス幅の合計）/ （結合文字行数－１）",null,null,null,null,null,null,null,null,null,null,null,null,null,1,"0001",0,0,0,1]
[null,null,"（５）ページレイアウトは奇数ページ目に背景JPEG＋文字画像（PNG)、偶数ページ目にOCRテキストレイヤを表示",null,null,null,null,null,null,null,null,null,null,null,null,null,1,"0001",0,0,0,1]
[null,null,"　　⇒ページ数は原稿の２倍となる",null,null,null,null,null,null,null,null,null,null,null,null,null,1,"0001",0,0,0,1]
[null,null,"※表示は見開き２ページとする",null,null,null,null,null,null,null,null,null,null,null,null,null,1,"0001",0,0,0,1]
[null,null,null,null,null,null,null,null,null,null,null,null,null,null,null,null,null,"","","","",""]
[null,null,null,null,null,null,null,null,null,null,null,null,null,null,null,null,null,"","","","",""]
[null,null,null,null,null,null,null,null,null,null,null,null,null,null,null,null,null,"","","","",""]
[null,null,null,null,null,null,null,null,null,null,null,null,null,null,null,null,null,"","","","",""]
[null,null,null,null,null,null,null,null,null,null,null,null,null,null,null,null,null,"","","","",""]
[null,null,null,null,null,null,null,null,null,null,null,null,null,null,null,null,null,"","","","",""]
[null,null,null,null,null,null,null,null,null,null,null,null,null,null,null,null,null,"","","","",""]
[null,null,null,null,null,null,null,null,null,null,null,null,null,null,null,null,null,"","","","",""]
[null,null,null,null,null,null,null,null,null,null,null,null,null,null,null,null,null,"","","","",""]
[null,null,null,null,null,null,null,null,null,null,null,null,null,null,null,null,null,"","","","",""]
[null,null,null,null,null,null,null,null,null,null,null,null,null,null,null,null,null,"","","","",""]
[null,null,null,null,null,null,null,null,null,null,null,null,null,null,null,null,null,"","","","",""]
[null,null,null,null,null,null,null,null,null,null,null,null,null,null,null,null,null,"","","","",""]
[null,null,null,null,null,null,null,null,null,null,null,null,null,null,null,null,null,"","","","",""]
[null,null,null,null,null,null,null,null,null,null,null,null,null,null,null,null,null,"","","","",""]
[null,null,null,null,null,null,null,null,null,null,null,null,null,null,null,null,null,"","","","",""]
[null,null,null,null,null,null,null,null,null,null,null,null,null,null,null,null,null,"","","","",""]
[null,null,null,null,null,null,null,null,null,null,null,null,null,null,null,null,null,"","","","",""]
[null,null,null,null,null,null,null,null,null,null,null,null,null,null,null,null,null,"","","","",""]
[null,null,null,null,null,null,null,null,null,null,null,null,null,null,null,null,null,"","","","",""]
[null,null,null,null,null,null,"図３　処理結果",null,null,null,null,null,null,null,null,null,1,"0001",0,0,0,1]
[null,null,null,null,null,null,null,null,null,null,null,null,null,null,null,null,null,"","","","",""]
[null,null,null,null,null,null,null,null,null,null,null,null,null,null,null,null,null,"","","","",""]
[null,null,null,null,null,null,null,null,null,null,null,null,null,null,null,null,null,"","","","",""]
[null,null,null,null,null,null,null,null,null,null,null,null,null,null,null,null,null,"","","","",""]
[null,null,null,null,null,null,null,null,null,null,null,null,null,null,null,null,null,"","","","",""]
[null,null,null,null,null,null,null,null,null,null,null,null,null,null,null,null,null,"","","","",""]
[null,null,null,null,null,null,null,null,null,null,null,null,null,null,null,null,null,"","","","",""]
[null,null,null,null,null,null,null,null,null,null,null,null,null,null,null,null,null,"","","","",""]
[null,null,null,null,null,null,null,null,null,null,null,null,null,null,null,null,null,"","","","",""]
[null,null,null,null,null,null,null,null,null,null,null,null,null,null,null,null,null,"","","","",""]
[null,null,null,null,null,null,null,null,null,null,null,null,null,null,null,null,null,"","","","",""]
[null,null,null,null,null,null,null,null,null,null,null,null,null,null,null,null,null,"","","","",""]
[null,null,null,null,null,null,null,null,null,null,null,null,null,null,null,null,null,"","","","",""]
[null,null,null,null,null,null,null,null,null,null,null,null,null,null,null,null,null,"","","","",""]
[null,null,null,null,null,null,"図４　レイヤ構造",null,null,null,null,null,null,null,null,null,1,"0001",0,0,0,1]
[null,null,null,null,null,null,null,null,null,null,null,null,null,null,null,null,null,"","","","",""]
[null,null,null,null,null,null,null,null,null,null,null,null,null,null,null,null,null,"","","","",""]
[null,null,null,null,null,null,null,null,null,null,null,null,null,null,null,null,null,"","","","",""]
[null,null,null,null,null,null,null,null,null,null,null,null,null,null,null,null,null,"","","","",""]
[null,null,null,null,null,null,null,null,null,null,null,null,null,null,null,null,null,"","","","",""]
[null,null,null,null,null,null,null,null,null,null,null,null,null,null,null,null,null,"","","","",""]
[null,"◆出力形式：文字優先",null,null,null,null,null,null,null,null,null,null,null,null,null,null,1,"0001",0,0,0,1]
[null,null,null,null,null,null,null,null,null,null,null,null,null,null,null,null,null,"","","","",""]
[null,null,"（１）OCRの結果、座標位置が近いテキスト同士は結合して一つのテキストボックスとする",null,null,null,null,null,null,null,null,null,null,null,null,null,1,"0001",0,0,0,1]
[null,null,"※横書きであれば上側文字の左下座標と他のテキストの左上座標、",null,null,null,null,null,null,null,null,null,null,null,null,null,1,"0001",0,0,0,1]
[null,null,"　 縦書きであれば右側文字の左上座標と他のテキストの右上座標の距離に応じてボックスを結合する。",null,null,null,null,null,null,null,null,null,null,null,null,null,1,"0001",0,0,0,1]
[null,null,"（２）結合されても結合前のそれぞれのフォントサイズは維持する",null,null,null,null,null,null,null,null,null,null,null,null,null,1,"0001",0,0,0,1]
[null,null,"（３）結合されたテキストボックスのサイズは、全てのテキストボックスを内包する矩形サイズとする",null,null,null,null,null,null,null,null,null,null,null,null,null,1,"0001",0,0,0,1]
[null,null,"（４）下記算術方法にて行間距離を決定する",null,null,null,null,null,null,null,null,null,null,null,null,null,1,"0001",0,0,0,1]
[null,null,"※横書き：（上述のテキストボックスの縦サイズ - 結合された全テキストボックス高さの合計）/ （結合文字行数－１）",null,null,null,null,null,null,null,null,null,null,null,null,null,1,"0001",0,0,0,1]
[null,null,"　 縦書き：（上述のテキストボックスの横サイズ - 結合された全テキストボックス幅の合計）/ （結合文字行数－１）",null,null,null,null,null,null,null,null,null,null,null,null,null,1,"0001",0,0,0,1]
[null,null,"（５）ページレイヤ構造を図3に示すように、Word表示エリア⇒背景JPEGレイヤ⇒OCRテキストレイヤ　とする",null,null,null,null,null,null,null,null,null,null,null,null,null,1,"0001",0,0,0,1]
[null,null,"※　誤認識しているOCR処理結果も表示される",null,null,null,null,null,null,null,null,null,null,null,null,null,1,"0001",0,0,0,1]
[null,null,null,null,null,null,null,null,null,null,null,null,null,null,null,null,null,"","","","",""]
[null,null,null,null,null,null,null,null,null,null,null,null,null,null,null,null,null,"","","","",""]
[null,null,null,null,null,null,null,null,null,null,null,null,null,null,null,null,null,{"$f":"IF(Q131=\"\",\"\",DEC2BIN(Q131,4))","v":""},{"$f":"IF($R131=\"\",\"\",VALUE(MID($R131,1,1)))","v":""},{"$f":"IF($R131=\"\",\"\",VALUE(MID($R131,2,1)))","v":""},{"$f":"IF($R131=\"\",\"\",VALUE(MID($R131,3,1)))","v":""},{"$f":"IF($R131=\"\",\"\",VALUE(MID($R131,4,1)))","v":""}]
[null,null,null,null,null,null,null,null,null,null,null,null,null,null,null,null,null,"","","","",""]
[null,null,null,null,null,null,null,null,null,null,null,null,null,null,null,null,null,"","","","",""]
[null,null,null,null,null,null,null,null,null,null,null,null,null,null,null,null,null,"","","","",""]
[null,null,null,null,null,null,null,null,null,null,null,null,null,null,null,null,null,"","","","",""]
[null,null,null,null,null,null,null,null,null,null,null,null,null,null,null,null,null,"","","","",""]
[null,null,null,null,null,null,null,null,null,null,null,null,null,null,null,null,null,"","","","",""]
[null,null,null,null,null,null,null,null,null,null,null,null,null,null,null,null,null,"","","","",""]
[null,null,null,null,null,null,null,null,null,null,null,null,null,null,null,null,null,"","","","",""]
[null,null,null,null,null,null,null,null,null,null,null,null,null,null,null,null,null,"","","","",""]
[null,null,null,null,null,null,null,null,null,null,null,null,null,null,null,null,null,"","","","",""]
[null,null,null,null,null,null,null,null,null,null,null,null,null,null,null,null,null,"","","","",""]
[null,null,null,null,null,null,null,null,null,null,null,null,null,null,null,null,null,"","","","",""]
[null,null,null,null,null,null,"図５　処理結果＆レイヤ構造",null,null,null,null,null,null,null,null,null,1,"0001",0,0,0,1]
[null,null,null,null,null,null,null,null,null,null,null,null,null,null,null,null,null,"","","","",""]
[null,null,null,null,null,null,null,null,null,null,null,null,null,null,null,null,null,"","","","",""]
[null,"◆出力形式：画像のみ",null,null,null,null,null,null,null,null,null,null,null,null,null,null,1,"0001",0,0,0,1]
[null,null,null,null,null,null,null,null,null,null,null,null,null,null,null,null,null,"","","","",""]
[null,null,"（１）スキャン画像だけをはりつける(OCR機能off時)",null,null,null,null,null,null,null,null,null,null,null,null,null,1,"0001",0,0,0,1]
[null,null,null,null,null,null,null,null,null,null,null,null,null,null,null,null,null,"","","","",""]
[null,null,null,null,null,null,null,null,null,null,null,null,null,null,null,null,null,"","","","",""]
[null,null,null,null,null,null,null,null,null,null,null,null,null,null,null,null,null,"","","","",""]
[null,null,null,null,null,null,null,null,null,null,null,null,null,null,null,null,null,"","","","",""]
[null,null,null,null,null,null,null,null,null,null,null,null,null,null,null,null,null,"","","","",""]
[null,null,null,null,null,null,null,null,null,null,null,null,null,null,null,null,null,"","","","",""]
[null,null,null,null,null,null,null,null,null,null,null,null,null,null,null,null,null,"","","","",""]
[null,null,null,null,null,null,null,null,null,null,null,null,null,null,null,null,null,"","","","",""]
[null,null,null,null,null,null,null,null,null,null,null,null,null,null,null,null,null,"","","","",""]
[null,null,null,null,null,null,null,null,null,null,null,null,null,null,null,null,null,"","","","",""]
[null,null,null,null,null,null,null,null,null,null,null,null,null,null,null,null,null,"","","","",""]
[null,null,null,null,null,null,null,null,null,null,null,null,null,null,null,null,null,"","","","",""]
[null,null,null,null,null,null,null,null,null,null,null,null,null,null,null,null,null,"","","","",""]
[null,null,null,null,null,null,null,null,null,null,null,null,null,null,null,null,null,"","","","",""]
[null,null,null,null,null,null,"図６　レイヤ構造",null,null,null,null,null,null,null,null,null,1,"0001",0,0,0,1]
[null,null,null,null,null,null,null,null,null,null,null,null,null,null,null,null,null,"","","","",""]
[null,null,null,null,null,null,null,null,null,null,null,null,null,null,null,null,null,"","","","",""]
[null,null,null,null,null,null,null,null,null,null,null,null,null,null,null,null,null,"","","","",""]
[null,null,null,null,null,null,null,null,null,null,null,null,null,null,null,null,null,"","","","",""]
[null,null,null,null,null,null,null,null,null,null,null,null,null,null,null,null,null,"","","","",""]
[null,null,null,null,null,null,null,null,null,null,null,null,null,null,null,null,null,"","","","",""]
[null,null,null,null,null,null,null,null,null,null,null,null,null,null,null,null,null,"","","","",""]
[null,null,null,null,null,null,null,null,null,null,null,null,null,null,null,null,null,"","","","",""]
[null,null,null,null,null,null,null,null,null,null,null,null,null,null,null,null,null,"","","","",""]
["３．OOXML Excel　の出力形式 ",null,null,null,null,null,null,null,null,null,null,null,null,null,null,null,1,"0001",0,0,0,1]
[null,null,null,null,null,null,null,null,null,null,null,null,null,null,null,null,null,"","","","",""]
[null,"◆出力形式：画像と文字",null,null,null,null,null,null,null,null,null,null,null,null,null,null,1,"0001",0,0,0,1]
[null,null,null,null,null,null,null,null,null,null,null,null,null,null,null,null,null,"","","","",""]
[null,null,"（１）一つのセルに一つのocr結果(ocr結果は行単位で出力される)が当てはまるように、計算する。",null,null,null,null,null,null,null,null,null,null,null,null,null,1,"0001",0,0,0,1]
[null,null,"(ocr結果の、左上座標点、左下座標点から計算する)",null,null,null,null,null,null,null,null,null,null,null,null,null,1,"0001",0,0,0,1]
[null,null,"（２）行の高さをフォントサイズにそろえる",null,null,null,null,null,null,null,null,null,null,null,null,null,1,"0001",0,0,0,1]
[null,null,"（３）縦書きがある場合は、縦方向のセル結合を行う。ただし、テキストが書かれているセルと重なっている場合は、",null,null,null,null,null,null,null,null,null,null,null,null,null,1,"0001",0,0,0,1]
[null,null,"テキストが書かれているセルの、一つ手前のセルまでの結合に留める。更に、横方向のセル結合は行わない",null,null,null,null,null,null,null,null,null,null,null,null,null,1,"0001",0,0,0,1]
[null,null,"（４）最後に左側にスキャン画像を、右側にテキスト結果(ocr機能on時のみ)を張り付ける。",null,null,null,null,null,null,null,null,null,null,null,null,null,1,"0001",0,0,0,1]
[null,null,null,null,null,null,null,null,null,null,null,null,null,null,null,null,null,"","","","",""]
[null,null,null,null,null,null,null,null,null,null,null,null,null,null,null,null,null,"","","","",""]
[null,null,null,null,null,null,null,null,null,null,null,null,null,null,null,null,null,"","","","",""]
[null,null,null,null,null,null,null,null,null,null,null,null,null,null,null,null,null,"","","","",""]
[null,null,null,null,null,null,null,null,null,null,null,null,null,null,null,null,null,"","","","",""]
[null,null,null,null,null,null,null,null,null,null,null,null,null,null,null,null,null,"","","","",""]
[null,null,null,null,null,null,null,null,null,null,null,null,null,null,null,null,null,"","","","",""]
[null,null,null,null,null,null,null,null,null,null,null,null,null,null,null,null,null,"","","","",""]
[null,null,null,null,null,null,null,null,null,null,null,null,null,null,null,null,null,"","","","",""]
[null,null,null,null,null,null,null,null,null,null,null,null,null,null,null,null,null,"","","","",""]
[null,null,null,null,null,null,null,null,null,null,null,null,null,null,null,null,null,"","","","",""]
[null,null,null,null,null,null,null,null,null,null,null,null,null,null,null,null,null,{"$f":"IF(Q195=\"\",\"\",DEC2BIN(Q195,4))","v":""},{"$f":"IF($R195=\"\",\"\",VALUE(MID($R195,1,1)))","v":""},{"$f":"IF($R195=\"\",\"\",VALUE(MID($R195,2,1)))","v":""},{"$f":"IF($R195=\"\",\"\",VALUE(MID($R195,3,1)))","v":""},{"$f":"IF($R195=\"\",\"\",VALUE(MID($R195,4,1)))","v":""}]
[null,null,null,null,null,null,null,null,null,null,null,null,null,null,null,null,null,"","","","",""]
[null,null,null,null,null,null,null,null,null,null,null,null,null,null,null,null,null,"","","","",""]
[null,null,null,null,null,null,null,null,null,null,null,null,null,null,null,null,null,"","","","",""]
[null,null,null,null,null,null,null,null,null,null,null,null,null,null,null,null,null,"","","","",""]
[null,null,null,null,null,null,null,null,null,null,null,null,null,null,null,null,null,"","","","",""]
[null,null,null,null,null,null,null,null,null,null,null,null,null,null,null,null,null,"","","","",""]
[null,null,null,null,null,null,null,null,null,null,null,null,null,null,null,null,null,"","","","",""]
[null,null,null,null,null,null,null,null,null,null,null,null,null,null,null,null,null,"","","","",""]
[null,null,null,null,null,null,null,null,null,null,null,null,null,null,null,null,null,"","","","",""]
[null,null,null,null,null,null,null,null,null,null,null,null,null,null,null,null,null,"","","","",""]
[null,null,null,null,null,null,null,null,null,null,null,null,null,null,null,null,null,"","","","",""]
[null,null,null,null,null,null,null,null,null,null,null,null,null,null,null,null,null,"","","","",""]
[null,null,null,null,null,null,null,null,null,null,null,null,null,null,null,null,null,"","","","",""]
[null,null,null,null,null,null,null,null,null,null,null,null,null,null,null,null,null,"","","","",""]
[null,null,null,null,null,null,null,null,null,null,null,null,null,null,null,null,null,"","","","",""]
[null,null,null,null,null,null,null,null,null,null,null,null,null,null,null,null,null,"","","","",""]
[null,null,null,null,null,null,null,null,null,null,null,null,null,null,null,null,null,"","","","",""]
[null,null,null,null,null,null,null,null,null,null,null,null,null,null,null,null,null,"","","","",""]
[null,null,null,null,null,null,null,null,null,null,null,null,null,null,null,null,null,"","","","",""]
[null,null,null,null,null,null,"図７　処理結果",null,null,null,null,null,null,null,null,null,1,"0001",0,0,0,1]
[null,null,null,null,null,null,null,null,null,null,null,null,null,null,null,null,null,"","","","",""]
[null,null,null,null,null,null,null,null,null,null,null,null,null,null,null,null,null,"","","","",""]
[null,null,null,null,null,null,null,null,null,null,null,null,null,null,null,null,null,"","","","",""]
[null,null,null,null,null,null,null,null,null,null,null,null,null,null,null,null,null,"","","","",""]
[null,null,null,null,null,null,null,null,null,null,null,null,null,null,null,null,null,"","","","",""]
[null,null,null,null,null,null,null,null,null,null,null,null,null,null,null,null,null,"","","","",""]
[null,null,null,null,null,null,null,null,null,null,null,null,null,null,null,null,null,"","","","",""]
[null,null,null,null,null,null,null,null,null,null,null,null,null,null,null,null,null,"","","","",""]
[null,null,null,null,null,null,null,null,null,null,null,null,null,null,null,null,null,"","","","",""]
[null,null,null,null,null,null,null,null,null,null,null,null,null,null,null,null,null,"","","","",""]
[null,null,null,null,null,null,null,null,null,null,null,null,null,null,null,null,null,"","","","",""]
[null,null,null,null,null,null,null,null,null,null,null,null,null,null,null,null,null,"","","","",""]
[null,null,null,null,null,null,null,null,null,null,null,null,null,null,null,null,null,"","","","",""]
[null,null,null,null,null,null,null,null,null,null,null,null,null,null,null,null,null,"","","","",""]
[null,null,null,null,null,null,null,null,null,null,null,null,null,null,null,null,null,"","","","",""]
[null,"◆出力形式：文字のみ",null,null,null,null,null,null,null,null,null,null,null,null,null,null,1,"0001",0,0,0,1]
[null,null,null,null,null,null,null,null,null,null,null,null,null,null,null,null,null,"","","","",""]
[null,null,"（１）一つのセルに一つのocr結果(ocr結果は行単位で出力される)が当てはまるように、計算する。",null,null,null,null,null,null,null,null,null,null,null,null,null,1,"0001",0,0,0,1]
[null,null,"(ocr結果の、左上座標点、左下座標点から計算する)",null,null,null,null,null,null,null,null,null,null,null,null,null,1,"0001",0,0,0,1]
[null,null,"（２）行の高さをフォントサイズにそろえる",null,null,null,null,null,null,null,null,null,null,null,null,null,1,"0001",0,0,0,1]
[null,null,"（３）縦書きがある場合は、縦方向のセル結合を行う。ただし、テキストが書かれているセルと重なっている場合は、",null,null,null,null,null,null,null,null,null,null,null,null,null,1,"0001",0,0,0,1]
[null,null,"テキストが書かれているセルの、一つ手前のセルまでの結合に留める。更に、横方向のセル結合は行わない",null,null,null,null,null,null,null,null,null,null,null,null,null,1,"0001",0,0,0,1]
[null,null,"（４）テキスト結果(ocr機能on時のみ)を張り付ける。",null,null,null,null,null,null,null,null,null,null,null,null,null,1,"0001",0,0,0,1]
[null,null,null,null,null,null,null,null,null,null,null,null,null,null,null,null,null,"","","","",""]
[null,null,null,null,null,null,null,null,null,null,null,null,null,null,null,null,null,"","","","",""]
[null,null,null,null,null,null,null,null,null,null,null,null,null,null,null,null,null,"","","","",""]
[null,null,null,null,null,null,null,null,null,null,null,null,null,null,null,null,null,"","","","",""]
[null,null,null,null,null,null,null,null,null,null,null,null,null,null,null,null,null,"","","","",""]
[null,null,null,null,null,null,null,null,null,null,null,null,null,null,null,null,null,"","","","",""]
[null,null,null,null,null,null,null,null,null,null,null,null,null,null,null,null,null,"","","","",""]
[null,null,null,null,null,null,null,null,null,null,null,null,null,null,null,null,null,"","","","",""]
[null,null,null,null,null,null,null,null,null,null,null,null,null,null,null,null,null,"","","","",""]
[null,null,null,null,null,null,null,null,null,null,null,null,null,null,null,null,null,"","","","",""]
[null,null,null,null,null,null,null,null,null,null,null,null,null,null,null,null,null,"","","","",""]
[null,null,null,null,null,null,null,null,null,null,null,null,null,null,null,null,null,"","","","",""]
[null,null,null,null,null,null,null,null,null,null,null,null,null,null,null,null,null,"","","","",""]
[null,null,null,null,null,null,null,null,null,null,null,null,null,null,null,null,null,"","","","",""]
[null,null,null,null,null,null,null,null,null,null,null,null,null,null,null,null,null,"","","","",""]
[null,null,null,null,null,null,null,null,null,null,null,null,null,null,null,null,null,"","","","",""]
[null,null,null,null,null,null,null,null,null,null,null,null,null,null,null,null,null,"","","","",""]
[null,null,null,null,null,null,null,null,null,null,null,null,null,null,null,null,null,"","","","",""]
[null,null,null,null,null,null,null,null,null,null,null,null,null,null,null,null,null,"","","","",""]
[null,null,null,null,null,null,null,null,null,null,null,null,null,null,null,null,null,"","","","",""]
[null,null,null,null,null,null,null,null,null,null,null,null,null,null,null,null,null,{"$f":"IF(Q259=\"\",\"\",DEC2BIN(Q259,4))","v":""},{"$f":"IF($R259=\"\",\"\",VALUE(MID($R259,1,1)))","v":""},{"$f":"IF($R259=\"\",\"\",VALUE(MID($R259,2,1)))","v":""},{"$f":"IF($R259=\"\",\"\",VALUE(MID($R259,3,1)))","v":""},{"$f":"IF($R259=\"\",\"\",VALUE(MID($R259,4,1)))","v":""}]
[null,null,null,null,null,null,null,null,null,null,null,null,null,null,null,null,null,"","","","",""]
[null,null,null,null,null,null,null,null,null,null,null,null,null,null,null,null,null,"","","","",""]
[null,null,null,null,null,null,null,null,null,null,null,null,null,null,null,null,null,"","","","",""]
[null,null,null,null,null,null,null,null,null,null,null,null,null,null,null,null,null,"","","","",""]
[null,null,null,null,null,null,null,null,null,null,null,null,null,null,null,null,null,"","","","",""]
[null,null,null,null,null,null,null,null,null,null,null,null,null,null,null,null,null,"","","","",""]
[null,null,null,null,null,null,null,null,null,null,null,null,null,null,null,null,null,"","","","",""]
[null,null,null,null,null,null,null,null,null,null,null,null,null,null,null,null,null,"","","","",""]
[null,null,null,null,null,null,"図８　処理結果",null,null,null,null,null,null,null,null,null,1,"0001",0,0,0,1]
[null,null,null,null,null,null,null,null,null,null,null,null,null,null,null,null,null,"","","","",""]
[null,null,null,null,null,null,null,null,null,null,null,null,null,null,null,null,null,"","","","",""]
[null,null,null,null,null,null,null,null,null,null,null,null,null,null,null,null,null,"","","","",""]
[null,null,null,null,null,null,null,null,null,null,null,null,null,null,null,null,null,"","","","",""]
[null,null,null,null,null,null,null,null,null,null,null,null,null,null,null,null,null,"","","","",""]
[null,null,null,null,null,null,null,null,null,null,null,null,null,null,null,null,null,"","","","",""]
[null,null,null,null,null,null,null,null,null,null,null,null,null,null,null,null,null,"","","","",""]
[null,null,null,null,null,null,null,null,null,null,null,null,null,null,null,null,null,"","","","",""]
[null,null,null,null,null,null,null,null,null,null,null,null,null,null,null,null,null,"","","","",""]
[null,null,null,null,null,null,null,null,null,null,null,null,null,null,null,null,null,"","","","",""]
[null,null,null,null,null,null,null,null,null,null,null,null,null,null,null,null,null,"","","","",""]
[null,null,null,null,null,null,null,null,null,null,null,null,null,null,null,null,null,"","","","",""]
[null,null,null,null,null,null,null,null,null,null,null,null,null,null,null,null,null,"","","","",""]
[null,null,null,null,null,null,null,null,null,null,null,null,null,null,null,null,null,"","","","",""]
[null,null,null,null,null,null,null,null,null,null,null,null,null,null,null,null,null,"","","","",""]
[null,null,null,null,null,null,null,null,null,null,null,null,null,null,null,null,null,"","","","",""]
[null,null,null,null,null,null,null,null,null,null,null,null,null,null,null,null,null,"","","","",""]
[null,null,null,null,null,null,null,null,null,null,null,null,null,null,null,null,null,"","","","",""]
[null,null,null,null,null,null,null,null,null,null,null,null,null,null,null,null,null,"","","","",""]
[null,"◆出力形式：画像のみ",null,null,null,null,null,null,null,null,null,null,null,null,null,null,1,"0001",0,0,0,1]
[null,null,null,null,null,null,null,null,null,null,null,null,null,null,null,null,null,"","","","",""]
[null,null,"（１）スキャン画像だけをはりつける(OCR機能off時)",null,null,null,null,null,null,null,null,null,null,null,null,null,1,"0001",0,0,0,1]
[null,null,null,null,null,null,null,null,null,null,null,null,null,null,null,null,null,"","","","",""]
[null,null,null,null,null,null,null,null,null,null,null,null,null,null,null,null,null,"","","","",""]
[null,null,null,null,null,null,null,null,null,null,null,null,null,null,null,null,null,"","","","",""]
[null,null,null,null,null,null,null,null,null,null,null,null,null,null,null,null,null,"","","","",""]
[null,null,null,null,null,null,null,null,null,null,null,null,null,null,null,null,null,"","","","",""]
[null,null,null,null,null,null,null,null,null,null,null,null,null,null,null,null,null,"","","","",""]
[null,null,null,null,null,null,null,null,null,null,null,null,null,null,null,null,null,"","","","",""]
[null,null,null,null,null,null,null,null,null,null,null,null,null,null,null,null,null,"","","","",""]
[null,null,null,null,null,null,null,null,null,null,null,null,null,null,null,null,null,"","","","",""]
[null,null,null,null,null,null,null,null,null,null,null,null,null,null,null,null,null,"","","","",""]
[null,null,null,null,null,null,null,null,null,null,null,null,null,null,null,null,null,"","","","",""]
[null,null,null,null,null,null,null,null,null,null,null,null,null,null,null,null,null,"","","","",""]
[null,null,null,null,null,null,null,null,null,null,null,null,null,null,null,null,null,"","","","",""]
[null,null,null,null,null,null,null,null,null,null,null,null,null,null,null,null,null,"","","","",""]
[null,null,null,null,null,null,null,null,null,null,null,null,null,null,null,null,null,"","","","",""]
[null,null,null,null,null,null,null,null,null,null,null,null,null,null,null,null,null,"","","","",""]
[null,null,null,null,null,null,null,null,null,null,null,null,null,null,null,null,null,"","","","",""]
[null,null,null,null,null,null,null,null,null,null,null,null,null,null,null,null,null,"","","","",""]
[null,null,null,null,null,null,null,null,null,null,null,null,null,null,null,null,null,"","","","",""]
[null,null,null,null,null,null,null,null,null,null,null,null,null,null,null,null,null,"","","","",""]
[null,null,null,null,null,null,null,null,null,null,null,null,null,null,null,null,null,"","","","",""]
[null,null,null,null,null,null,null,null,null,null,null,null,null,null,null,null,null,"","","","",""]
[null,null,null,null,null,null,null,null,null,null,null,null,null,null,null,null,null,"","","","",""]
[null,null,null,null,null,null,null,null,null,null,null,null,null,null,null,null,null,"","","","",""]
[null,null,null,null,null,null,null,null,null,null,null,null,null,null,null,null,null,"","","","",""]
[null,null,null,null,null,null,null,null,null,null,null,null,null,null,null,null,null,"","","","",""]
[null,null,null,null,null,null,null,null,null,null,null,null,null,null,null,null,null,"","","","",""]
[null,null,null,null,null,null,null,null,null,null,null,null,null,null,null,null,null,"","","","",""]
[null,null,null,null,null,null,null,null,null,null,null,null,null,null,null,null,null,"","","","",""]
[null,null,null,null,null,null,"図９　処理結果",null,null,null,null,null,null,null,null,null,1,"0001",0,0,0,1]
[null,null,null,null,null,null,null,null,null,null,null,null,null,null,null,null,null,"","","","",""]
[null,null,null,null,null,null,null,null,null,null,null,null,null,null,null,null,null,"","","","",""]
[null,null,null,null,null,null,null,null,null,null,null,null,null,null,null,null,null,{"$f":"IF(Q323=\"\",\"\",DEC2BIN(Q323,4))","v":""},{"$f":"IF($R323=\"\",\"\",VALUE(MID($R323,1,1)))","v":""},{"$f":"IF($R323=\"\",\"\",VALUE(MID($R323,2,1)))","v":""},{"$f":"IF($R323=\"\",\"\",VALUE(MID($R323,3,1)))","v":""},{"$f":"IF($R323=\"\",\"\",VALUE(MID($R323,4,1)))","v":""}]
[null,null,null,null,null,null,null,null,null,null,null,null,null,null,null,null,null,"","","","",""]
[null,null,null,null,null,null,null,null,null,null,null,null,null,null,null,null,null,"","","","",""]
[null,null,null,null,null,null,null,null,null,null,null,null,null,null,null,null,null,"","","","",""]
[null,null,null,null,null,null,null,null,null,null,null,null,null,null,null,null,null,"","","","",""]
[null,null,null,null,null,null,null,null,null,null,null,null,null,null,null,null,null,"","","","",""]
[null,null,null,null,null,null,null,null,null,null,null,null,null,null,null,null,null,"","","","",""]
[null,null,null,null,null,null,null,null,null,null,null,null,null,null,null,null,null,"","","","",""]
[null,null,null,null,null,null,null,null,null,null,null,null,null,null,null,null,null,"","","","",""]
[null,null,null,null,null,null,null,null,null,null,null,null,null,null,null,null,null,"","","","",""]
[null,null,null,null,null,null,null,null,null,null,null,null,null,null,null,null,null,"","","","",""]
[null,null,null,null,null,null,null,null,null,null,null,null,null,null,null,null,null,"","","","",""]
[null,null,null,null,null,null,null,null,null,null,null,null,null,null,null,null,null,"","","","",""]
[null,null,null,null,null,null,null,null,null,null,null,null,null,null,null,null,null,"","","","",""]
[null,null,null,null,null,null,null,null,null,null,null,null,null,null,null,null,null,"","","","",""]
[null,null,null,null,null,null,null,null,null,null,null,null,null,null,null,null,null,"","","","",""]
[null,null,null,null,null,null,null,null,null,null,null,null,null,null,null,null,null,"","","","",""]
[null,null,null,null,null,null,null,null,null,null,null,null,null,null,null,null,null,"","","","",""]
[null,null,null,null,null,null,null,null,null,null,null,null,null,null,null,null,null,"","","","",""]
[null,null,null,null,null,null,null,null,null,null,null,null,null,null,null,null,null,"","","","",""]
[null,null,null,null,null,null,null,null,null,null,null,null,null,null,null,null,null,"","","","",""]
[null,null,null,null,null,null,null,null,null,null,null,null,null,null,null,null,null,"","","","",""]
[null,"※Excelファイル出力時の複数ページ対応",null,null,null,null,null,null,null,null,null,null,null,null,null,null,1,"0001",0,0,0,1]
[null,null,null,null,null,null,null,null,null,null,null,null,null,null,null,null,null,"","","","",""]
[null,null,"1ページごとに別シートで用意する。",null,null,null,null,null,null,null,null,null,null,null,null,null,1,"0001",0,0,0,1]
[null,null,"(1シートだけでは、標準表示で、何ページスキャンしたのかが一目で分かりにくいため)",null,null,null,null,null,null,null,null,null,null,null,null,null,1,"0001",0,0,0,1]
[null,null,"デフォルトでは255ページ(シート)ごとに別ファイルにする。",null,null,null,null,null,null,null,null,null,null,null,null,null,1,"0001",0,0,0,1]
[null,null,"(excel2003だとデフォルト最大シート数が255枚のため)",null,null,null,null,null,null,null,null,null,null,null,null,null,1,"0001",0,0,0,1]
[null,null,"1つのbookに作成できるシート数はユーザーがパネルから設定できる。",null,null,null,null,null,null,null,null,null,null,null,null,null,1,"0001",0,0,0,1]
[null,null,"注意：数十ページスキャンすると(シート数が増加するため)開くのに時間がかかる可能性あり。",null,null,null,null,null,null,null,null,null,null,null,null,null,1,"0001",0,0,0,1]
[null,null,null,null,null,null,null,null,null,null,null,null,null,null,null,null,null,"","","","",""]
[null,null,null,null,null,null,null,null,null,null,null,null,null,null,null,null,null,"","","","",""]
[null,null,null,null,null,null,null,null,null,null,null,null,null,null,null,null,null,"","","","",""]
[null,null,null,null,null,null,null,null,null,null,null,null,null,null,null,null,null,"","","","",""]
[null,null,null,null,null,null,null,null,null,null,null,null,null,null,null,null,null,"","","","",""]
[null,null,null,null,null,null,null,null,null,null,null,null,null,null,null,null,null,"","","","",""]
[null,null,null,null,null,null,null,null,null,null,null,null,null,null,null,null,null,"","","","",""]
[null,null,null,null,null,null,null,null,null,null,null,null,null,null,null,null,null,"","","","",""]
[null,null,null,null,null,null,null,null,null,null,null,null,null,null,null,null,null,"","","","",""]
[null,null,null,null,null,null,null,null,null,null,null,null,null,null,null,null,null,"","","","",""]
[null,null,null,null,null,null,null,null,null,null,null,null,null,null,null,null,null,"","","","",""]
[null,null,null,null,null,null,null,null,null,null,null,null,null,null,null,null,null,"","","","",""]
[null,null,null,null,null,null,null,null,null,null,null,null,null,null,null,null,null,"","","","",""]
[null,null,null,null,null,null,null,null,null,null,null,null,null,null,null,null,null,"","","","",""]
[null,null,null,null,null,null,null,null,null,null,null,null,null,null,null,null,null,"","","","",""]
[null,null,null,null,null,null,null,null,null,null,null,null,null,null,null,null,null,"","","","",""]
[null,null,null,null,null,null,null,null,null,null,null,null,null,null,null,null,null,"","","","",""]
[null,null,null,null,null,null,null,null,null,null,null,null,null,null,null,null,null,"","","","",""]
[null,null,null,null,null,null,null,null,null,null,null,null,null,null,null,null,null,"","","","",""]
[null,null,null,null,null,null,null,null,null,null,null,null,null,null,null,null,null,"","","","",""]
[null,null,null,null,null,null,null,null,null,null,null,null,null,null,null,null,null,"","","","",""]
[null,null,null,null,null,null,null,null,null,null,null,null,null,null,null,null,null,"","","","",""]
[null,null,null,null,null,null,null,null,null,null,null,null,null,null,null,null,null,"","","","",""]
[null,null,null,null,null,null,null,null,null,null,null,null,null,null,null,null,null,"","","","",""]
[null,null,null,null,null,null,null,null,null,null,null,null,null,null,null,null,null,"","","","",""]
[null,null,null,null,null,null,"図１０　複数ページ対応",null,null,null,null,null,null,null,null,null,1,"0001",0,0,0,1]
[null,null,null,null,null,null,null,null,null,null,null,null,null,null,null,null,null,"","","","",""]
[null,null,null,null,null,null,null,null,null,null,null,null,null,null,null,null,null,"","","","",""]
[null,null,null,null,null,null,null,null,null,null,null,null,null,null,null,null,null,"","","","",""]
[null,null,null,null,null,null,null,null,null,null,null,null,null,null,null,null,null,"","","","",""]
[null,null,null,null,null,null,null,null,null,null,null,null,null,null,null,null,null,"","","","",""]
[null,null,null,null,null,null,null,null,null,null,null,null,null,null,null,null,null,"","","","",""]
[null,null,null,null,null,null,null,null,null,null,null,null,null,null,null,null,null,"","","","",""]
[null,null,null,null,null,null,null,null,null,null,null,null,null,null,null,null,null,"","","","",""]
[null,null,null,null,null,null,null,null,null,null,null,null,null,null,null,null,null,{"$f":"IF(Q387=\"\",\"\",DEC2BIN(Q387,4))","v":""},{"$f":"IF($R387=\"\",\"\",VALUE(MID($R387,1,1)))","v":""},{"$f":"IF($R387=\"\",\"\",VALUE(MID($R387,2,1)))","v":""},{"$f":"IF($R387=\"\",\"\",VALUE(MID($R387,3,1)))","v":""},{"$f":"IF($R387=\"\",\"\",VALUE(MID($R387,4,1)))","v":""}]
[null,null,null,null,null,null,null,null,null,null,null,null,null,null,null,null,null,"","","","",""]
[null,null,null,null,null,null,null,null,null,null,null,null,null,null,null,null,null,"","","","",""]
[null,null,null,null,null,null,null,null,null,null,null,null,null,null,null,null,null,"","","","",""]
[null,null,null,null,null,null,null,null,null,null,null,null,null,null,null,null,null,"","","","",""]
[null,null,null,null,null,null,null,null,null,null,null,null,null,null,null,null,null,"","","","",""]
[null,null,null,null,null,null,null,null,null,null,null,null,null,null,null,null,null,"","","","",""]
[null,null,null,null,null,null,null,null,null,null,null,null,null,null,null,null,null,"","","","",""]
[null,null,null,null,null,null,null,null,null,null,null,null,null,null,null,null,null,"","","","",""]
[null,null,null,null,null,null,null,null,null,null,null,null,null,null,null,null,null,"","","","",""]
[null,null,null,null,null,null,null,null,null,null,null,null,null,null,null,null,null,"","","","",""]
[null,null,null,null,null,null,null,null,null,null,null,null,null,null,null,null,null,"","","","",""]
[null,null,null,null,null,null,null,null,null,null,null,null,null,null,null,null,null,"","","","",""]
[null,null,null,null,null,null,null,null,null,null,null,null,null,null,null,null,null,"","","","",""]
[null,"【Zeus5BK以降】（*1）",null,null,null,null,null,null,null,null,null,null,null,null,null,null,1,"0001",0,0,0,1]
[null,null,null,null,null,null,null,null,null,null,null,null,null,null,null,null,null,"","","","",""]
[null,"※Word,Excelファイル出力時の表構造再現対応",null,null,null,null,null,null,null,null,null,null,null,null,null,null,1,"0001",0,0,0,1]
[null,null,"(下記、太字部分を追加対応する)",null,null,null,null,null,null,null,null,null,null,null,null,null,1,"0001",0,0,0,1]
[null,null,null,null,null,null,null,null,null,null,null,null,null,null,null,null,null,"","","","",""]
[null,null,"Excel形式",null,null,null,null,null,null,null,null,null,null,null,null,null,1,"0001",0,0,0,1]
[null,null,"(1)文字優先：OCR結果のみ出力する。表領域は表として再現する",null,null,null,null,null,null,null,null,null,null,null,null,null,1,"0001",0,0,0,1]
[null,null,"(2)文字と画像：シートの左側に入力画像を貼り付け、右側にOCR結果を貼りつけて出力する。表領域は表として再現する",null,null,null,null,null,null,null,null,null,null,null,null,null,1,"0001",0,0,0,1]
[null,null,"※表再現は表のセル構造の再現を指し、点線や色つきの罫線は黒実線として再現する。セル色の再現は未対応。",null,null,null,null,null,null,null,null,null,null,null,null,null,1,"0001",0,0,0,1]
[null,null,null,null,null,null,null,null,null,null,null,null,null,null,null,null,null,"","","","",""]
[null,null,"Word形式",null,null,null,null,null,null,null,null,null,null,null,null,null,1,"0001",0,0,0,1]
[null,null,"(1)文字優先：OCR結果のみ出力する。表領域は表として再現する",null,null,null,null,null,null,null,null,null,null,null,null,null,1,"0001",0,0,0,1]
[null,null,"(2)画像優先：入力画像の背後にOCR結果を隠ぺいして貼り付ける(サーチャブル機能)",null,null,null,null,null,null,null,null,null,null,null,null,null,1,"0001",0,0,0,1]
[null,null,"(3)文字と画像：奇数ページに入力画像を貼り付け、偶数ページにOCR結果を貼りつけて出力する。表領域は表として再現する",null,null,null,null,null,null,null,null,null,null,null,null,null,1,"0001",0,0,0,1]
[null,null,"※表再現は表のセル構造の再現を指し、点線や色つきの罫線は黒実線として再現する。セル色の再現は未対応。",null,null,null,null,null,null,null,null,null,null,null,null,null,1,"0001",0,0,0,1]
[null,null,null,null,null,null,null,null,null,null,null,null,null,null,null,null,null,"","","","",""]
[null,null,null,null,null,null,null,null,null,null,null,null,null,null,null,null,null,"","","","",""]
[null,null,"＜OOXML　表構造再現仕様＞",null,null,null,null,null,null,null,null,null,null,null,null,null,1,"0001",0,0,0,1]
[null,null,null,null,null,null,null,null,null,null,null,null,null,null,null,null,null,"","","","",""]
[null,null,"表の持つ特性の内、再現可能のものと再現できないもの（未対応含む）がある。表１にまとめる",null,null,null,null,null,null,null,null,null,null,null,null,null,1,"0001",0,0,0,1]
[null,null,null,null,null,null,null,null,null,null,null,null,null,null,null,null,null,"","","","",""]
[null,null,"表１ 表再現仕様",null,null,null,null,null,null,null,null,null,null,null,null,null,1,"0001",0,0,0,1]
[null,null,null,"構成要素",null,"説明",null,null,null,null,null,null,null,null,null,null,1,"0001",0,0,0,1]
[null,null,"再現する特性","セルの数・配置",null,null,null,null,null,null,null,null,null,null,null,null,1,"0001",0,0,0,1]
[null,null,null,"セルのサイズ",null,"高さ・幅を再現する。",null,null,null,null,null,null,null,null,null,null,1,"0001",0,0,0,1]
[null,null,null,"セルの結合",null,"行・列・行列方向のセルの結合を再現する。\nまた、カギ型など複雑な形状も再現する。",null,null,null,null,null,null,null,null,null,null,1,"0001",0,0,0,1]
[null,null,null,"セル内文字の配置",null,"行方向：左・中央・右揃え\n列方向：上・中央・下揃え を再現する。",null,null,null,null,null,null,null,null,null,null,1,"0001",0,0,0,1]
[null,null,null,"OCR文字色",null,"原稿の文字色を再現する\n※ただし、黒文字に含まれるグレー文字など、2色以上の無彩色が同一文字列内に含まれる場合のみ平均色で再現する。",null,null,null,null,null,null,null,null,null,null,1,"0001",0,0,0,1]
[null,null,null,"OCR文字の方向",null,"縦書き・横書きを再現する。",null,null,null,null,null,null,null,null,null,null,1,"0001",0,0,0,1]
[null,null,"再現しない特性","セル色",null,"常に白色とする。\n※Zeus5BK以降の機種で対応予定",null,null,null,null,null,null,null,null,null,null,1,"0001",0,0,0,1]
[null,null,null,"罫線色",null,"常に黒色とする。",null,null,null,null,null,null,null,null,null,null,1,"0001",0,0,0,1]
[null,null,null,"罫線の太さ",null,"常にデフォルト線（0.5pt）とする。",null,null,null,null,null,null,null,null,null,null,1,"0001",0,0,0,1]
[null,null,null,"罫線の形状",null,"常に実線とする。",null,null,null,null,null,null,null,null,null,null,1,"0001",0,0,0,1]
[null,null,null,"下地色",null,"常に無色とする。",null,null,null,null,null,null,null,null,null,null,1,"0001",0,0,0,1]
[null,null,null,null,null,null,null,null,null,null,null,null,null,null,null,null,null,"","","","",""]
[null,null,"【その他の仕様】",null,null,null,null,null,null,null,null,null,null,null,null,null,1,"0001",0,0,0,1]
[null,null,"・表外の文字について\n　Excel出力の場合のみ、文字列をExcelのセルに埋め込む必要があることから、原稿の文字列の位置関係によりレイアウトがズレる場合がある。ただし、表画像はセルのサイズを基準としているため正しく再現可能である。",null,null,null,null,null,null,null,null,null,null,null,null,null,1,"0001",0,0,0,1]
[null,null,null,null,null,null,null,null,null,null,null,null,null,null,null,null,null,"","","","",""]
[null,null,null,null,null,null,null,null,null,null,null,null,null,null,null,null,null,"","","","",""]
[null,null,null,null,null,null,null,null,null,null,null,null,null,null,null,null,null,"","","","",""]
[null,null,null,null,null,null,null,null,null,null,null,null,null,null,null,null,null,"","","","",""]
[null,null,null,null,null,null,null,null,null,null,null,null,null,null,null,null,null,"","","","",""]
[null,null,null,null,null,null,null,null,null,null,null,null,null,null,null,null,null,"","","","",""]
[null,null,null,null,null,null,null,null,null,null,null,null,null,null,null,null,null,"","","","",""]
[null,null,null,null,null,null,null,null,null,null,null,null,null,null,null,null,null,"","","","",""]
[null,null,null,null,null,null,null,null,null,null,null,null,null,null,null,null,null,"","","","",""]
[null,null,null,null,null,null,null,null,null,null,null,null,null,null,null,null,null,"","","","",""]
[null,null,null,null,null,null,null,null,null,null,null,null,null,null,null,null,null,"","","","",""]
[null,null,null,null,null,null,null,null,null,null,null,null,null,null,null,null,null,"","","","",""]
[null,null,null,null,null,null,null,null,null,null,null,null,null,null,null,null,null,"","","","",""]
[null,null,null,null,null,null,null,null,null,null,null,null,null,null,null,null,null,{"$f":"IF(Q451=\"\",\"\",DEC2BIN(Q451,4))","v":""},{"$f":"IF($R451=\"\",\"\",VALUE(MID($R451,1,1)))","v":""},{"$f":"IF($R451=\"\",\"\",VALUE(MID($R451,2,1)))","v":""},{"$f":"IF($R451=\"\",\"\",VALUE(MID($R451,3,1)))","v":""},{"$f":"IF($R451=\"\",\"\",VALUE(MID($R451,4,1)))","v":""}]
[null,null,null,null,null,null,null,null,null,null,null,null,null,null,null,null,null,"","","","",""]
[null,null,null,null,null,null,null,null,null,null,null,null,null,null,null,null,null,"","","","",""]
[null,null,null,null,null,null,null,null,null,null,null,null,null,null,null,null,null,"","","","",""]
[null,null,null,null,null,null,null,null,null,null,null,null,null,null,null,null,null,"","","","",""]
[null,null,null,null,null,null,null,null,null,null,null,null,null,null,null,null,null,"","","","",""]
[null,null,null,null,null,null,null,null,null,null,null,null,null,null,null,null,null,"","","","",""]
[null,null,null,null,null,null,null,null,null,null,null,null,null,null,null,null,null,"","","","",""]
[null,null,null,null,null,null,null,null,null,null,null,null,null,null,null,null,null,"","","","",""]
[null,null,null,null,null,null,null,null,null,null,null,null,null,null,null,null,null,"","","","",""]
[null,null,null,null,null,null,null,null,null,null,null,null,null,null,null,null,null,"","","","",""]
[null,null,null,null,null,null,null,null,null,null,null,null,null,null,null,null,null,"","","","",""]
[null,null,null,null,null,null,null,null,null,null,null,null,null,null,null,null,null,"","","","",""]
[null,null,null,null,null,null,null,null,null,null,null,null,null,null,null,null,null,"","","","",""]
[null,null,null,null,null,null,null,null,null,null,null,null,null,null,null,null,null,"","","","",""]
[null,null,null,null,null,null,null,null,null,null,null,null,null,null,null,null,null,"","","","",""]
[null,null,null,null,null,null,null,null,null,null,null,null,null,null,null,null,null,"","","","",""]
[null,null,null,null,null,null,null,null,null,null,null,null,null,null,null,null,null,"","","","",""]
[null,null,null,null,null,null,null,null,null,null,null,null,null,null,null,null,null,"","","","",""]
[null,null,null,null,null,null,null,null,null,null,null,null,null,null,null,null,null,"","","","",""]
[null,null,null,null,null,null,null,null,null,null,null,null,null,null,null,null,null,"","","","",""]
[null,null,null,null,null,null,null,null,null,null,null,null,null,null,null,null,null,"","","","",""]
[null,null,null,null,null,null,null,null,null,null,null,null,null,null,null,null,null,"","","","",""]
[null,null,null,null,null,null,null,null,null,null,null,null,null,null,null,null,null,"","","","",""]
[null,null,null,null,null,null,null,null,null,null,null,null,null,null,null,null,null,"","","","",""]
[null,null,null,null,null,null,null,null,null,null,null,null,null,null,null,null,null,"","","","",""]
[null,null,null,null,null,null,null,null,null,null,null,null,null,null,null,null,null,"","","","",""]
[null,null,null,null,null,null,null,null,null,null,null,null,null,null,null,null,null,"","","","",""]
[null,null,null,null,null,null,null,null,null,null,null,null,null,null,null,null,null,"","","","",""]
[null,null,null,null,null,null,null,null,null,null,null,null,null,null,null,null,null,"","","","",""]
[null,null,null,null,null,null,null,null,null,null,null,null,null,null,null,null,null,"","","","",""]
[null,null,null,null,null,null,null,null,null,null,null,null,null,null,null,null,null,"","","","",""]
[null,null,null,null,null,null,null,null,null,null,null,null,null,null,null,null,null,"","","","",""]
[null,null,null,null,null,null,"図１１　表構造再現対応",null,null,null,null,null,null,null,null,null,1,"0001",0,0,0,1]
[null,null,null,null,null,null,null,null,null,null,null,null,null,null,null,null,null,"","","","",""]
[null,null,null,null,null,null,null,null,null,null,null,null,null,null,null,null,null,"","","","",""]
[null,null,null,null,null,null,null,null,null,null,null,null,null,null,null,null,null,"","","","",""]
[null,null,null,null,null,null,null,null,null,null,null,null,null,null,null,null,null,"","","","",""]
[null,null,null,null,null,null,null,null,null,null,null,null,null,null,null,null,null,"","","","",""]
[null,null,"【履歴】",null,null,null,null,null,null,null,null,null,null,null,null,null,1,"0001",0,0,0,1]
[null,null,null,"2011/XX/XX 初版　塚本",null,null,null,null,null,null,null,null,null,null,null,null,1,"0001",0,0,0,1]
[null,null,null,null,"UV-00973 OfficeOpenXML形式ファイル生成機能",null,null,null,null,null,null,null,null,null,null,null,1,"0001",0,0,0,1]
[null,null,null,null,"UV仕様書の添付ファイル（下記）より部分転記",null,null,null,null,null,null,null,null,null,null,null,1,"0001",0,0,0,1]
[null,null,null,null,"・3.Word追加仕様.pdf",null,null,null,null,null,null,null,null,null,null,null,1,"0001",0,0,0,1]
[null,null,null,null,"・9.110617顧客要望検討会excel機能仕様修正説明.pdf",null,null,null,null,null,null,null,null,null,null,null,1,"0001",0,0,0,1]
[null,null,null,null,null,null,null,null,null,null,null,null,null,null,null,null,null,"","","","",""]
[null,null,null,"2014/4/16 改訂 1OPS服部",null,null,null,null,null,null,null,null,null,null,null,null,1,"0001",0,0,0,1]
[null,null,null,null,"Zeus5BK対応",null,null,null,null,null,null,null,null,null,null,null,1,"0001",0,0,0,1]
[null,null,null,null,"(*1)UV-01451 OfficeOpenXML形式ファイル(Word,Excel)の表構造再現対応",null,null,null,null,null,null,null,null,null,null,null,1,"0001",0,0,0,1]
[null,null,null,null,"UV-01451の納入仕様、及びUV仕様書の添付ファイル（下記）より部分転記",null,null,null,null,null,null,null,null,null,null,null,1,"0001",0,0,0,1]
[null,null,null,null,"・UV表構造再現仕様.xlsx",null,null,null,null,null,null,null,null,null,null,null,1,"0001",0,0,0,1]
[null,null,null,null,null,null,null,null,null,null,null,null,null,null,null,"e","e","e","e","e","e","e"]
[]
[]
[]
[]
[]
[]
[]
[]
[]
[]
[]
[]
[]
[]
[]
[]
[]
[]
[]
[]
[]
[]
[]
[]
[]
[]
[]
[]
[]
[]
[]
[]
[]
[]
[]
[]
[]
[]
[]
[]
[]
[]
[]
[]
[]
[]
[]
[]
[]
[]
[]
[]
[]
[]
[]
[]
[]
[]
[]
[]
[]
[]
[]
[]
[]
[]
[]
[]
[]
[]
[]
[]
[]
[]
[]
[]
[]
[]
[]
[]
[]
[]
[]
[]
[]
[]
[]
[]
[]
[]
[]
[]
[]
[]
[]
[]
[]
[]
[]
[]
[]
[]
[]
[]
[]
[]
[]
[]
[]
[]
[]
[]
[]
[]
[]
[]
[]
[]
[]
[]
[]
[]
[]
[]
[]
[]
[]
[]
[]
[]
[]
[]
[]
[]
[]
[]
[]
[]
[]
[]
[]
[]
[]
[]
[]
[]
[]
[]
[]
[]
[]
[]
[]
[]
[]
[]
[]
[]
[]
[]
[]
[]
[]
[]
[]
[]
[]
[]
[]
[]
[]
[]
[]
[]
[]
[]
[]
[]
[]
[]
[]
[]
[]
[]
[]
[]
[]
[]
[]
[]
[]
[]
[]
[]
[]
[]
[]
[]
[]
[]
[]
[]
[]
[]
[]
[]
[]
[]
[]
[]
[]
[]
[]
[]
[]
[]
[]
[]
[]
[]
[]
[]
[]
[]
[]
[]
[]
[]
[]
[]
[]
[]
[]
[]
[]
[]
[]
[]
[]
[]
[]
[]
[]
[]
[]
[]
[]
[]
[]
[]
[]
[]
[]
[]
[]
[]
[]
[]
[]
[]
[]
[]
[]
[]
[]
[]
[]
[]
[]
[]
[]
[]
[]
[]
[]
[]
[]
[]
[]
[]
[]
[]
[]
[]
[]
[]
[]
[]
[]
[]
[]
[]
[]
[]
[]
[]
[]
[]
[]
[]
[]
[]
[]
[]
[]
[]
[]
[]
[]
[]
[]
[]
[]
[]
[]
[]
[]
[]
[]
[]
[]
[]
[]
[]
[]
[]
[]
[]
[]
[]
[]
[]
[]
[]
[]
[]
[]
[]
[]
[]
[]
[]
[]
[]
[]
[]
[]
[]
[]
[]
[]
[]
[]
[]
[]
[]
[]
[]
[]
[]
[]
[]
[]
[]
[]
[]
[]
[]
[]
[]
[]
[]
[]
[]
[]
[]
[]
[]
[]
[]
[]
[]
[]
[]
[]
[]
[]
[]
[]
[]
[]
[]
[]
[]
[]
[]
[]
[]
[]
[]
[]
[]
[]
[]
[]
[]
[]
[]
[]
[]
[]
[]
[]
[]
[]
[]
[]
[]
[]
[]
[]
[]
[]
[]
[]
[]
[]
[]
[]
[]
[]
[]
[]
[]
[]
[]
[]
[]
[]
[]
[]
[]
[]
[]
[]
[]
[]
[]
[]
[]
[]
[]
[]
[]
[]
[]
[]
[]
[]
[]
[]
[]
[]
[]
[]
[]
[]
[]
[]
[]
[]
[]
[]
[]
[]
[]
[]
[]
[]
[]
[]
[]
[]
[]
[]
[]
[]
[]
[]
[]
[]
[]
[]
[]
[]
[]
[]
[]
[null,null,null,null,null,null,null,null,null,null,null,null,null,null,null,0]
[null,null,null,null,null,null,null,null,null,null,null,null,null,null,null,0]
[null,null,null,null,null,null,null,null,null,null,null,null,null,null,null,0]
[null,null,null,null,null,null,null,null,null,null,null,null,null,null,null,0]
[null,null,null,null,null,null,null,null,null,null,null,null,null,null,null,0]
[null,null,null,null,null,null,null,null,null,null,null,null,null,null,null,0]
[null,null,null,null,null,null,null,null,null,null,null,null,null,null,null,0]
[null,null,null,null,null,null,null,null,null,null,null,null,null,null,null,0]
[null,null,null,null,null,null,null,null,null,null,null,null,null,null,null,0]
[null,null,null,null,null,null,null,null,null,null,null,null,null,null,null,0]
[null,null,null,null,null,null,null,null,null,null,null,null,null,null,null,0]
[null,null,null,null,null,null,null,null,null,null,null,null,null,null,null,0]
[null,null,null,null,null,null,null,null,null,null,null,null,null,null,null,0]
[null,null,null,null,null,null,null,null,null,null,null,null,null,null,null,0]
[null,null,null,null,null,null,null,null,null,null,null,null,null,null,null,0]

{"sheet":"リファイン履歴","index":8,"n_rows":1005,"n_cols":12,"rows_kept":1005,"cut":false,"hidden":false,"merged":[]}
[null,null,null,null,null,"SP","F","BIN",4,3,2,1]
[null,"日付","版数","作業者","内容",null,null,{"$f":"IF(G2=\"\",\"\",DEC2BIN(G2,4))","v":""},{"$f":"IF($H2=\"\",\"\",VALUE(MID($H2,1,1)))","v":""},{"$f":"IF($H2=\"\",\"\",VALUE(MID($H2,2,1)))","v":""},{"$f":"IF($H2=\"\",\"\",VALUE(MID($H2,3,1)))","v":""},{"$f":"IF($H2=\"\",\"\",VALUE(MID($H2,4,1)))","v":""}]
[null,"2012-07-18","112版","河邉","履歴の適用欄をすべて\"－\"に変更。\n機能名称間の1行の適用をすべて○に変更",null,1,{"$f":"IF(G3=\"\",\"\",DEC2BIN(G3,4))","v":"0001"},{"$f":"IF($H3=\"\",\"\",VALUE(MID($H3,1,1)))","v":0},{"$f":"IF($H3=\"\",\"\",VALUE(MID($H3,2,1)))","v":0},{"$f":"IF($H3=\"\",\"\",VALUE(MID($H3,3,1)))","v":0},{"$f":"IF($H3=\"\",\"\",VALUE(MID($H3,4,1)))","v":1}]
[null,"2012-08-06","112版","上手","・「搭載機能仕様書(スキャナ編)」シートの機種適用欄の「Rhein」「Mosel」「Thames」「LaPlata」「Ganges」「LaPlataM」「GangesM」の列を削除。\n・「搭載機能仕様書(スキャナ編)」シートの修正発行版の99版以下の列を削除\n上記の削除前を参照の際は112版を参照ください。",null,1,"0001",0,0,0,1]
[null,null,null,null,null,"e","e","e","e","e","ee","e"]
[]
[]
[]
[]
[]
[]
[]
[]
[]
[]
[]
[]
[]
[]
[]
[]
[]
[]
[]
[]
[]
[]
[]
[]
[]
[]
[]
[]
[]
[]
[]
[]
[]
[]
[]
[]
[]
[]
[]
[]
[]
[]
[]
[]
[]
[]
[]
[]
[]
[]
[]
[]
[]
[]
[]
[]
[]
[]
[]
[]
[]
[]
[]
[]
[]
[]
[]
[]
[]
[]
[]
[]
[]
[]
[]
[]
[]
[]
[]
[]
[]
[]
[]
[]
[]
[]
[]
[]
[]
[]
[]
[]
[]
[]
[]
[]
[]
[]
[]
[]
[]
[]
[]
[]
[]
[]
[]
[]
[]
[]
[]
[]
[]
[]
[]
[]
[]
[]
[]
[]
[]
[]
[]
[]
[]
[]
[]
[]
[]
[]
[]
[]
[]
[]
[]
[]
[]
[]
[]
[]
[]
[]
[]
[]
[]
[]
[]
[]
[]
[]
[]
[]
[]
[]
[]
[]
[]
[]
[]
[]
[]
[]
[]
[]
[]
[]
[]
[]
[]
[]
[]
[]
[]
[]
[]
[]
[]
[]
[]
[]
[]
[]
[]
[]
[]
[]
[]
[]
[]
[]
[]
[]
[]
[]
[]
[]
[]
[]
[]
[]
[]
[]
[]
[]
[]
[]
[]
[]
[]
[]
[]
[]
[]
[]
[]
[]
[]
[]
[]
[]
[]
[]
[]
[]
[]
[]
[]
[]
[]
[]
[]
[]
[]
[]
[]
[]
[]
[]
[]
[]
[]
[]
[]
[]
[]
[]
[]
[]
[]
[]
[]
[]
[]
[]
[]
[]
[]
[]
[]
[]
[]
[]
[]
[]
[]
[]
[]
[]
[]
[]
[]
[]
[]
[]
[]
[]
[]
[]
[]
[]
[]
[]
[]
[]
[]
[]
[]
[]
[]
[]
[]
[]
[]
[]
[]
[]
[]
[]
[]
[]
[]
[]
[]
[]
[]
[]
[]
[]
[]
[]
[]
[]
[]
[]
[]
[]
[]
[]
[]
[]
[]
[]
[]
[]
[]
[]
[]
[]
[]
[]
[]
[]
[]
[]
[]
[]
[]
[]
[]
[]
[]
[]
[]
[]
[]
[]
[]
[]
[]
[]
[]
[]
[]
[]
[]
[]
[]
[]
[]
[]
[]
[]
[]
[]
[]
[]
[]
[]
[]
[]
[]
[]
[]
[]
[]
[]
[]
[]
[]
[]
[]
[]
[]
[]
[]
[]
[]
[]
[]
[]
[]
[]
[]
[]
[]
[]
[]
[]
[]
[]
[]
[]
[]
[]
[]
[]
[]
[]
[]
[]
[]
[]
[]
[]
[]
[]
[]
[]
[]
[]
[]
[]
[]
[]
[]
[]
[]
[]
[]
[]
[]
[]
[]
[]
[]
[]
[]
[]
[]
[]
[]
[]
[]
[]
[]
[]
[]
[]
[]
[]
[]
[]
[]
[]
[]
[]
[]
[]
[]
[]
[]
[]
[]
[]
[]
[]
[]
[]
[]
[]
[]
[]
[]
[]
[]
[]
[]
[]
[]
[]
[]
[]
[]
[]
[]
[]
[]
[]
[]
[]
[]
[]
[]
[]
[]
[]
[]
[]
[]
[]
[]
[]
[]
[]
[]
[]
[]
[]
[]
[]
[]
[]
[]
[]
[]
[]
[]
[]
[]
[]
[]
[]
[]
[]
[]
[]
[]
[]
[]
[]
[]
[]
[]
[]
[]
[]
[]
[]
[]
[]
[]
[]
[]
[]
[]
[]
[]
[]
[]
[]
[]
[]
[]
[]
[]
[]
[]
[]
[]
[]
[]
[]
[]
[]
[]
[]
[]
[]
[]
[]
[]
[]
[]
[]
[]
[]
[]
[]
[]
[]
[]
[]
[]
[]
[]
[]
[]
[]
[]
[]
[]
[]
[]
[]
[]
[]
[]
[]
[]
[]
[]
[]
[]
[]
[]
[]
[]
[]
[]
[]
[]
[]
[]
[]
[]
[]
[]
[]
[]
[]
[]
[]
[]
[]
[]
[]
[]
[]
[]
[]
[]
[]
[]
[]
[]
[]
[]
[]
[]
[]
[]
[]
[]
[]
[]
[]
[]
[]
[]
[]
[]
[]
[]
[]
[]
[]
[]
[]
[]
[]
[]
[]
[]
[]
[]
[]
[]
[]
[]
[]
[]
[]
[]
[]
[]
[]
[]
[]
[]
[]
[]
[]
[]
[]
[]
[]
[]
[]
[]
[]
[]
[]
[]
[]
[]
[]
[]
[]
[]
[]
[]
[]
[]
[]
[]
[]
[]
[]
[]
[]
[]
[]
[]
[]
[]
[]
[]
[]
[]
[]
[]
[]
[]
[]
[]
[]
[]
[]
[]
[]
[]
[]
[]
[]
[]
[]
[]
[]
[]
[]
[]
[]
[]
[]
[]
[]
[]
[]
[]
[]
[]
[]
[]
[]
[]
[]
[]
[]
[]
[]
[]
[]
[]
[]
[]
[]
[]
[]
[]
[]
[]
[]
[]
[]
[]
[]
[]
[]
[]
[]
[]
[]
[]
[]
[]
[]
[]
[]
[]
[]
[]
[]
[]
[]
[]
[]
[]
[]
[]
[]
[]
[]
[]
[]
[]
[]
[]
[]
[]
[]
[]
[]
[]
[]
[]
[]
[]
[]
[]
[]
[]
[]
[]
[]
[]
[]
[]
[]
[]
[]
[]
[]
[]
[]
[]
[]
[]
[]
[]
[]
[]
[]
[]
[]
[]
[]
[]
[]
[]
[]
[]
[]
[]
[]
[]
[]
[]
[]
[]
[]
[]
[]
[]
[]
[]
[]
[]
[]
[]
[]
[]
[]
[]
[]
[]
[]
[]
[]
[]
[]
[]
[]
[]
[]
[]
[]
[]
[]
[]
[]
[]
[]
[]
[]
[]
[]
[]
[]
[]
[]
[]
[]
[]
[]
[]
[]
[]
[]
[]
[]
[]
[]
[]
[]
[]
[]
[]
[]
[]
[]
[]
[]
[]
[]
[]
[]
[]
[]
[]
[]
[]
[]
[]
[]
[]
[]
[]
[]
[]
[]
[]
[]
[]
[]
[]
[]
[]
[]
[]
[]
[]
[]
[]
[]
[]
[]
[]
[]
[]
[]
[]
[]
[]
[]
[]
[]
[]
[]
[]
[]
[]
[]
[]
[]
[]
[]
[]
[]
[]
[]
[]
[]
[]
[]
[]
[]
[]
[]
[]
[]
[]
[]
[]
[]
[]
[null,null,null,null,null,0]
[null,null,null,null,null,0]
[null,null,null,null,null,0]
[null,null,null,null,null,0]
[null,null,null,null,null,0]